5-Vinyl-2-norbornene (endo)
- Formula: C9H12
- Molecular weight: 120.1916
- IUPAC Standard InChIKey: INYHZQLKOKTDAI-YIZRAAEISA-N
- Chemical structure:
View 3d structure (requires JavaScript / HTML 5) - Stereoisomers:
- Other names: endo-5-Ethenyl-2-norbornene

Kovats' RI, non-polar column, isothermal

Column type | Active phase | Temperature (C) | I | Reference | Comment |
---|---|---|---|---|---|
Capillary | SE-30 | 70. | 877.9 | Tóth, 1983 | N2; Column length: 15. m; Column diameter: 0.25 mm |

Kovats' RI, polar column, isothermal

Column type | Active phase | Temperature (C) | I | Reference | Comment |
---|---|---|---|---|---|
Capillary | PEG-20M | 70. | 1067.1 | Tóth, 1983 | N2; Column length: 30. m; Column diameter: 0.3 mm |

Normal alkane RI, non-polar column, custom temperature program

Column type | Active phase | I | Reference | Comment |
---|---|---|---|---|
Capillary | OV-101 | 875. | Zenkevich, 1998 | He; Column length: 25. m; Column diameter: 0.20 mm; Program: not specified |
Capillary | OV-101 | 877. | Zenkevich, 1998 | He; Column length: 25. m; Column diameter: 0.20 mm; Program: not specified |

References

Tóth, 1983
Tóth, T.,
Use of capillary gas chromatography in collecting retention and chemical information for the analysis of complex petrochemical mixtures,
J. Chromatogr., 1983, 279, 157-165, https://doi.org/10.1016/S0021-9673(01)93614-3
. [all data]
Zenkevich, 1998
Zenkevich, I.G.,
Application of Methods of Molecular Dynamics in Chromato-Spectral Identification of ISomeric Products of Organic reactions (in Russian),
Zh. Org. Khim., 1998, 34, 10, 1463-1470. [all data]