Bicyclo[2.2.1]-2-heptene, 5,6-bis-methylene
- Formula: C10H14
- Molecular weight: 134.2182
- IUPAC Standard InChIKey: RUBSRCIOICQTJU-SNVBAGLBSA-N
- Chemical structure:
View 3d structure (requires JavaScript / HTML 5) - Permanent link for this species. Use this link for bookmarking this species for future reference.

Normal alkane RI, non-polar column, custom temperature program

Column type | Active phase | I | Reference | Comment |
---|---|---|---|---|
Capillary | Methyl Silicone | 880. | Zenkevich, 1995 | Program: not specified |

References

Zenkevich, 1995
Zenkevich, I.G.,
Calculation of Gas-Chromatographic Retention Indices from Physico-Chemical Constants of Organic Compounds,
Z. Anal. Chem., 1995, 50, 10, 1048-1056. [all data]