1,4-Cyclohexadiene, 1-(1-methylethenyl)
- Formula: C9H12
- Molecular weight: 120.1916
- IUPAC Standard InChIKey: WXSSKVGGMFMFAA-UHFFFAOYSA-N
- Chemical structure:
View 3d structure (requires JavaScript / HTML 5) - Permanent link for this species. Use this link for bookmarking this species for future reference.

Normal alkane RI, non-polar column, custom temperature program

Column type | Active phase | I | Reference | Comment |
---|---|---|---|---|
Capillary | Methyl Silicone | 997. | Zenkevich, 1995 | Program: not specified |

References

Zenkevich, 1995
Zenkevich, I.G.,
Calculation of Gas-Chromatographic Retention Indices from Physico-Chemical Constants of Organic Compounds,
Z. Anal. Chem., 1995, 50, 10, 1048-1056. [all data]