Cyclopropane, 1,1-dichloro, 2-ethyl-3-(2-phenylethyl). cis
- Formula: C13H16Cl2
- Molecular weight: 243.172
- IUPAC Standard InChIKey: UHSCWYYCXQZLGC-NEPJUHHUSA-N
- Chemical structure:
View 3d structure (requires JavaScript / HTML 5) - Stereoisomers:

Normal alkane RI, non-polar column, temperature ramp

Column type | Active phase | I | Reference | Comment |
---|---|---|---|---|
Capillary | OV-101 | 1633. | Chupalov, Molchanov, et al., 1994 | N2, 3. K/min; Column length: 52. m; Column diameter: 0.26 mm; Tstart: 50. C; Tend: 220. C |

References

Chupalov, Molchanov, et al., 1994
Chupalov, A.A.; Molchanov, A.p.; Zenkevich, I.G.,
Chromato-Mass-Spectrometric Characterization of Alkyl- and Aryl-1,1-dichlorocyclopropanes,
Zh. Obshch. Khim., 1994, 64, 6, 966-974. [all data]