Cyclopropane, 1,1-dichloro-2-(2-phenylethyl)
- Formula: C11H12Cl2
- Molecular weight: 215.119
- IUPAC Standard InChIKey: DCXFCFKVBBHSQD-UHFFFAOYSA-N
- Chemical structure:
View 3d structure (requires JavaScript / HTML 5) - Permanent link for this species. Use this link for bookmarking this species for future reference.

Normal alkane RI, non-polar column, temperature ramp

Column type | Active phase | I | Reference | Comment |
---|---|---|---|---|
Capillary | OV-101 | 1458. | Chupalov, Molchanov, et al., 1994 | N2, 3. K/min; Column length: 52. m; Column diameter: 0.26 mm; Tstart: 50. C; Tend: 220. C |

Normal alkane RI, polar column, temperature ramp

Column type | Active phase | I | Reference | Comment |
---|---|---|---|---|
Packed | Carbowax 20M | 1975. | Chupalov, Molchanov, et al., 1994 | N2, Chromaton N-AW, 3. K/min; Column length: 3. m; Column diameter: 0.26 mm; Tstart: 50. C; Tend: 220. C |

References

Chupalov, Molchanov, et al., 1994
Chupalov, A.A.; Molchanov, A.p.; Zenkevich, I.G.,
Chromato-Mass-Spectrometric Characterization of Alkyl- and Aryl-1,1-dichlorocyclopropanes,
Zh. Obshch. Khim., 1994, 64, 6, 966-974. [all data]