Carenol

Kovats' RI, non-polar column, isothermal

View large format table.

Column type Active phase Temperature (C) I Reference Comment
CapillaryPB-1130.1188.Engewald, Knobloch, et al., 1991Column length: 42. m; Column diameter: 0.32 mm

References

Engewald, Knobloch, et al., 1991
Engewald, W.; Knobloch, T.; Haufe, G.; Muller, M.; Pohris, V., A Novel Method for Terpene Pattern Determination of Essential Oils by Selectivity Tuning in GC, Fresenius' J. Anal. Chem., 1991, 341, 10, 641-643, https://doi.org/10.1007/BF00322279 . [all data]