trans-Decalin, 1a-methyl
- Formula: C11H20
- Molecular weight: 152.2765
- IUPAC Standard InChIKey: NHCREQREVZBOCH-DCAQKATOSA-N
- Chemical structure:
View 3d structure (requires JavaScript / HTML 5) - Stereoisomers:
- Naphthalene,decahydro-1-methyl-(1α,4aβ,8aα
- 1-Methyldecahydronaphthalene
- Naphthalene,decahydro-1-methyl-(1α,4aα,8aβ
- cis-Decalin, trans-1e-methyl, r-9H
- trans-Decalin, 1e-methyl
- cis,cis-Bicyclo[4.4.0]decane, 2-methyl
- cis,trans-Bicyclo[4.4.0]decane, 2-methyl
- trans,cis-Bicyclo[4.4.0]decane, 2-methyl
- trans,trans-Bicyclo[4.4.0]decane, 2-methyl
- 1-Methyldecalin, cis
- 1-Methyldecalin, trans

Kovats' RI, non-polar column, isothermal

Column type | Active phase | Temperature (C) | I | Reference | Comment |
---|---|---|---|---|---|
Packed | OV-101 | 120. | 1168. | Litvinenko, Isakova, et al., 1988 | He, Chromaton W AW; Column length: 2.4 m |

References

Litvinenko, Isakova, et al., 1988
Litvinenko, G.S.; Isakova, L.A.; Rubanyk, N.N.,
Quantitative correlation between structure of stereoisomeric saturated cyclic compounds and gas-chromatographic retention indices. I. Methysubstituted,
Izv. AN Kaz. SSR, Ser. Khim., 1988, 5, 54-66. [all data]