Piperidin, 2e-methyl
- Formula: C6H13N
- Molecular weight: 99.1741
- IUPAC Standard InChIKey: NNWUEBIEOFQMSS-ZCFIWIBFSA-N
- Chemical structure:
View 3d structure (requires JavaScript / HTML 5) - Stereoisomers:

Kovats' RI, non-polar column, isothermal

Column type | Active phase | Temperature (C) | I | Reference | Comment |
---|---|---|---|---|---|
Packed | OV-101 | 120. | 801. | Litvinenko, Isakova, et al., 1988 | He, Chromaton W AW; Column length: 2.4 m |

References

Litvinenko, Isakova, et al., 1988
Litvinenko, G.S.; Isakova, L.A.; Rubanyk, N.N.,
Quantitative correlation between structure of stereoisomeric saturated cyclic compounds and gas-chromatographic retention indices. I. Methysubstituted,
Izv. AN Kaz. SSR, Ser. Khim., 1988, 5, 54-66. [all data]