Piperidin, 2e,6e-dimethyl
- Formula: C7H15N
- Molecular weight: 113.2007
- IUPAC Standard InChIKey: SDGKUVSVPIIUCF-KNVOCYPGSA-N
- Chemical structure:
View 3d structure (requires JavaScript / HTML 5) - Species with the same structure:
- Stereoisomers:

Kovats' RI, non-polar column, isothermal

Column type | Active phase | Temperature (C) | I | Reference | Comment |
---|---|---|---|---|---|
Packed | OV-101 | 120. | 832. | Litvinenko, Isakova, et al., 1988 | He, Chromaton W AW; Column length: 2.4 m |

References

Litvinenko, Isakova, et al., 1988
Litvinenko, G.S.; Isakova, L.A.; Rubanyk, N.N.,
Quantitative correlation between structure of stereoisomeric saturated cyclic compounds and gas-chromatographic retention indices. I. Methysubstituted,
Izv. AN Kaz. SSR, Ser. Khim., 1988, 5, 54-66. [all data]