(Z)-Dihydroocimene
- Formula: C10H18
- Molecular weight: 138.2499
- IUPAC Standard InChIKey: WUIFRGYQELQKDN-NTMALXAHSA-N
- Chemical structure:
View 3d structure (requires JavaScript / HTML 5) - Species with the same structure:
- Stereoisomers:
- Other names: cis-dihydroocimene

Kovats' RI, non-polar column, temperature ramp

Column type | Active phase | I | Reference | Comment |
---|---|---|---|---|
Capillary | Methyl Silicone | 998.6 | Rao, Rajanikanth, et al., 1989 | 4. K/min, 250. C @ 15. min; Column length: 12. m; Column diameter: 0.5 mm; Tstart: 70. C |

Normal alkane RI, non-polar column, custom temperature program

Column type | Active phase | I | Reference | Comment |
---|---|---|---|---|
Capillary | OV-101 | 982. | Shibamoto, 1987 | Program: not specified |

Normal alkane RI, polar column, custom temperature program

Column type | Active phase | I | Reference | Comment |
---|---|---|---|---|
Capillary | Carbowax 20M | 1088. | Shibamoto, 1987 | Program: not specified |

References

Rao, Rajanikanth, et al., 1989
Rao, A.S.; Rajanikanth, B.; Seshadri, R.,
Volatile aroma components of Curcuma amada Roxb.,
J. Agric. Food Chem., 1989, 37, 3, 740-743, https://doi.org/10.1021/jf00087a036
. [all data]
Shibamoto, 1987
Shibamoto, T.,
Retention Indices in Essential Oil Analysis
in Capillary Gas Chromatography in Essential Oil Analysis, Sandra, P.; Bicchi, C., ed(s)., Hutchig Verlag, Heidelberg, New York, 1987, 259-274. [all data]