B-Ribopyranose, TMS
- Formula: C17H42O5Si4
- Molecular weight: 438.8544
- IUPAC Standard InChIKey: KEOUSSOURMHEKN-LUKYLMHMSA-N
- Chemical structure:
View 3d structure (requires JavaScript / HTML 5) - Stereoisomers:
- α-D-Xylopyranose, 4TMS derivative
- β-D-Xylopyranose, 4TMS derivative
- A-Lyxopyranose, TMS
- A-Ribopyranose, TMS
- B-Arabinopyranose, TMS
- B-Lyxopyranose, TMS
- A-Arabinopyranose, TMS
- α-D(-)-Lyxose, pyranose, TMS
- β-D(-)-Lyxose, pyranose, TMS
- α-D-(-)-Ribopyranose, 4TMS derivative
- β-D-(-)-Ribopyranose, 4TMS derivative
- β-D-(+)-Xylopyranose, 4TMS derivative
- D-Arabinopyranose, 4TMS derivative (isomer 1)
- D-Arabinopyranose, 4TMS derivative (isomer 2)
- DL-Arabinopyranose, 4TMS derivative
- β-D(-)-Lyxopyranose, 4TMS derivative
- α-D-(-)-Lyxopyranose, 4TMS derivative
- Other names: β-D-Ribopyranose, TMS

Kovats' RI, non-polar column, isothermal

Column type | Active phase | Temperature (C) | I | Reference | Comment |
---|---|---|---|---|---|
Capillary | SE-54 | 180. | 1642. | García-Raso, Martínez-Castro, et al., 1987 | Column length: 40. m; Column diameter: 0.18 mm |
Capillary | SE-54 | 180. | 1692. | Paez, Martínez-Castro, et al., 1987 | Column length: 45. m; Column diameter: 0.18 mm |

Kovats' RI, polar column, isothermal

Column type | Active phase | Temperature (C) | I | Reference | Comment |
---|---|---|---|---|---|
Capillary | Carbowax 20M | 160. | 1531. | García-Raso, Martínez-Castro, et al., 1987 | Column length: 25. m; Column diameter: 0.22 mm |

References

García-Raso, Martínez-Castro, et al., 1987
García-Raso, A.; Martínez-Castro, I.; Páez, M.I.; Sanz, J.; García-Raso, J.; Saura-Calixto, F.,
Gas Chromatographic Behaviour of Carbohydrate Trimethylsilyl Ethers. I. Aldopentoses,
J. Chromatogr., 1987, 398, 9-20, https://doi.org/10.1016/S0021-9673(01)96491-X
. [all data]
Paez, Martínez-Castro, et al., 1987
Paez, M.; Martínez-Castro, I.; Sanz, J.; Olano, A.; García-Raso, A.; Saura-Calixto, F.,
Identification of the components of aldoses in a tautomeric equilibrium mixture as their trimethylsilyl ethers by capillary cas chromatography,
Chromatographia, 1987, 23, 1, 43-46, https://doi.org/10.1007/BF02310417
. [all data]