A-Lyxofuranose, TMS
- Formula: C17H42O5Si4
- Molecular weight: 438.8544
- IUPAC Standard InChIKey: LDFPXMNJVPETIY-HZMVEIRTSA-N
- Chemical structure:
View 3d structure (requires JavaScript / HTML 5) - Species with the same structure:
- Stereoisomers:
- A-Arabinofuranose, TMS
- A-Ribofuranose, TMS
- B-Arabinofuranose, TMS
- Xylofuranose # 1, TMS
- Xylofuranose # 2, TMS
- α-D-Ribofuranose, TMS
- α-d-Xylofuranose, TMS
- β-D-lyxofuranose, TMS
- β-D-Ribofuranose, TMS
- β-D-xylofuranose, TMS
- D-(-)-Ribofuranose, tetrakis(trimethylsilyl) ether (isomer 1)
- D-(-)-Ribofuranose, tetrakis(trimethylsilyl) ether (isomer 2)
- D-(-)-Lyxofuranose, tetrakis(trimethylsilyl) ether
- Other names: α-Lyxose, TMS

Kovats' RI, non-polar column, isothermal

Column type | Active phase | Temperature (C) | I | Reference | Comment |
---|---|---|---|---|---|
Capillary | SE-54 | 180. | 1633. | García-Raso, Martínez-Castro, et al., 1987 | Column length: 40. m; Column diameter: 0.18 mm |
Packed | SE-30 | 210. | 1610. | Saura-Calixto, Cañellas, et al., 1984 | N2, Supelcoport (80-100mesh); Column length: 3. m |

Kovats' RI, polar column, isothermal

Column type | Active phase | Temperature (C) | I | Reference | Comment |
---|---|---|---|---|---|
Capillary | Carbowax 20M | 160. | 1543. | García-Raso, Martínez-Castro, et al., 1987 | Column length: 25. m; Column diameter: 0.22 mm |

References

García-Raso, Martínez-Castro, et al., 1987
García-Raso, A.; Martínez-Castro, I.; Páez, M.I.; Sanz, J.; García-Raso, J.; Saura-Calixto, F.,
Gas Chromatographic Behaviour of Carbohydrate Trimethylsilyl Ethers. I. Aldopentoses,
J. Chromatogr., 1987, 398, 9-20, https://doi.org/10.1016/S0021-9673(01)96491-X
. [all data]
Saura-Calixto, Cañellas, et al., 1984
Saura-Calixto, F.; Cañellas, J.; García-Raso, A.,
Gas chromatograph analysis of surgars and sugar-alcohols in the mesocarp, endocarp, and kernel of almond fruit,
J. Agric. Food Chem., 1984, 32, 5, 1018-1020, https://doi.org/10.1021/jf00125a017
. [all data]