1-Pentanol, 2,4-dimethyl, TMS
- Formula: C10H24OSi
- Molecular weight: 188.3825
- IUPAC Standard InChIKey: NRWBDVNLVCOSRW-UHFFFAOYSA-N
- Chemical structure:

Kovats' RI, non-polar column, isothermal

Column type | Active phase | Temperature (C) | I | Reference | Comment |
---|---|---|---|---|---|
Capillary | Methyl Silicone | 70. | 990. | Willis, 1986 | He; Column length: 61.0 m; Column diameter: 0.51 mm |

References

Willis, 1986
Willis, D.E.,
Multidimensional Gas Chromatographic Analysis of Hexene Hydroformylation Products Using Support-Coated Open-Tubular Columns with Column Sequence Reversal (Foreflushing),
J. Chromatogr. Sci., 1986, 24, 10, 417-422, https://doi.org/10.1093/chromsci/24.10.417
. [all data]