2,3-Dimethylstyrene
- Formula: C10H12
- Molecular weight: 132.2023
- IUPAC Standard InChIKey: HLOUDBQOEJSUPI-UHFFFAOYSA-N
- Chemical structure:
View 3d structure (requires JavaScript / HTML 5) - Other names: 1,2-Dimethyl-3-Vinylbenzene

Kovats' RI, non-polar column, isothermal

Column type | Active phase | Temperature (C) | I | Reference | Comment |
---|---|---|---|---|---|
Capillary | SE-30 | 70. | 1100.3 | Tóth, 1983 | N2; Column length: 15. m; Column diameter: 0.25 mm |
Capillary | SE-30 | 65. | 1097.1 | Svob and Deur-Siftar, 1974 | He; Column length: 25.5 m; Column diameter: 0.5 mm |

Kovats' RI, polar column, isothermal

Column type | Active phase | Temperature (C) | I | Reference | Comment |
---|---|---|---|---|---|
Capillary | PEG-20M | 70. | 1485.1 | Tóth, 1983 | N2; Column length: 30. m; Column diameter: 0.3 mm |

Normal alkane RI, non-polar column, custom temperature program

Column type | Active phase | I | Reference | Comment |
---|---|---|---|---|
Capillary | Polymethylsiloxane, (PMS-20000) | 1100. | Cornwell and Cordano, 2003 | Program: not specified |

Normal alkane RI, polar column, custom temperature program

Column type | Active phase | I | Reference | Comment |
---|---|---|---|---|
Capillary | Carbowax 20M | 1485. | Cornwell and Cordano, 2003 | Program: not specified |

References

Tóth, 1983
Tóth, T.,
Use of capillary gas chromatography in collecting retention and chemical information for the analysis of complex petrochemical mixtures,
J. Chromatogr., 1983, 279, 157-165, https://doi.org/10.1016/S0021-9673(01)93614-3
. [all data]
Svob and Deur-Siftar, 1974
Svob, V.; Deur-Siftar, D.,
Kovats Retention Indices in the Identification of Alkylbenzene Degradation Products,
J. Chromatogr., 1974, 91, 677-689, https://doi.org/10.1016/S0021-9673(01)97947-6
. [all data]
Cornwell and Cordano, 2003
Cornwell, E.; Cordano, G.,
Nueva proposicion para predecir datos de retencion obtenidos mediante cromatografia de gases de hidrocarburos derivados de las naftas,
Revista de la Sociedad Quimica de Mexico, 2003, 47, 1, 38-43. [all data]