(E)-3-Dihydromuconic acid, TMS
- Formula: C15H30O5Si3
- Molecular weight: 374.6522
- IUPAC Standard InChIKey: GIAYEVJAHHZGNG-MRBUWEIXSA-N
- Chemical structure:
View 3d structure (requires JavaScript / HTML 5) - Other names: (E)-3-Hydromuconic acid, TMS; (E)-Hydroxymuconic acid, TMS

Van Den Dool and Kratz RI, non-polar column, custom temperature program

Column type | Active phase | I | Reference | Comment |
---|---|---|---|---|
Packed | OV-101 | 1506. | Tanaka and Hine, 1982 | Program: not specified |

Normal alkane RI, non-polar column, temperature ramp

Column type | Active phase | I | Reference | Comment |
---|---|---|---|---|
Capillary | HP-5MS | 1532. | Lee, Yanamandra, et al., 2002 | 30. m/0.25 mm/0.25 μm, He, 70. C @ 3. min, 4. K/min, 280. C @ 3. min |
Capillary | HP-5MS | 1541. | Lee, Yanamandra, et al., 2002 | 30. m/0.25 mm/0.25 μm, He, 70. C @ 3. min, 4. K/min, 280. C @ 3. min |

References

Tanaka and Hine, 1982
Tanaka, K.; Hine, D.G.,
Compilation of Gas Chromatographic Retention Indices of 163 Metabolically Important Organic Acids, and Their Use in Detection of Patients with Organic Acidurias,
J. Chromatogr., 1982, 239, 301-322, https://doi.org/10.1016/S0021-9673(00)81990-1
. [all data]
Lee, Yanamandra, et al., 2002
Lee, B.Y.; Yanamandra, K.; Thurmon, T.F.,
Quantitative estimation of organic analytes with a capillary column,
Am. Clin. Lab., 2002, May, 30-34. [all data]