Cyclohexane, 1r,2t,4t-tris-ethenyl
- Formula: C12H18
- Molecular weight: 162.2713
- IUPAC Standard InChIKey: KTRQRAQRHBLCSQ-IJLUTSLNSA-N
- Chemical structure:
View 3d structure (requires JavaScript / HTML 5) - Stereoisomers:

Kovats' RI, non-polar column, isothermal

Column type | Active phase | Temperature (C) | I | Reference | Comment |
---|---|---|---|---|---|
Capillary | Squalane | 85. | 1093. | Engewald, Graefe, et al., 1974 | N2; Column length: 120. m; Column diameter: 0.20 mm |

References

Engewald, Graefe, et al., 1974
Engewald, W.; Graefe, J.; Kiselev, A.V.; Shcherbakova, K.D.; Welsch, Th.,
Molekülstruktur und Retentionsverhalten. I. Strukturelle Zuordnung von thermischen Umlagerungsprodukten der Cyclododecatriene-(1.5.9) mittels Gas-Adsorptions-Chromatographie,
Chromatographia, 1974, 7, 5, 229-235, https://doi.org/10.1007/BF02321773
. [all data]