5β-Androstan-3β-ol-17-one,bis-TMS

Normal alkane RI, non-polar column, temperature ramp

View large format table.

Column type Active phase I Reference Comment
CapillarySE-542529.Schänzer and Donike, 199220. m/0.25 mm/0.33 μm, He, 5. K/min; Tstart: 180. C; Tend: 300. C
CapillarySE-542531.Schänzer and Donike, 199215. m/0.2 mm/0.33 μm, He, 5. K/min; Tstart: 180. C; Tend: 300. C
CapillaryOV-1012519.Pfeifer and Spiteller, 1981H2, 2. K/min; Column length: 50. m; Column diameter: 0.30 mm; Tstart: 150. C; Tend: 300. C

References

Schänzer and Donike, 1992
Schänzer, W.; Donike, M., Metabolism of boldenone in man: gas chromatographic/mass spectrometric identification of urinary excreted metabolites and determination of excretion rates, Biol. Mass Spectrom., 1992, 21, 1, 3-16, https://doi.org/10.1002/bms.1200210104 . [all data]

Pfeifer and Spiteller, 1981
Pfeifer, P.; Spiteller, G., Steroid Profiles of Healthy Individuals, J. Chromatogr., 1981, 223, 1, 21-32, https://doi.org/10.1016/S0378-4347(00)80064-X . [all data]