Ethylene glycol, bis-DMPFPS
- Formula: C18H16F10O2Si2
- Molecular weight: 510.4735
- IUPAC Standard InChIKey: QXNCZSMPBQVIFQ-UHFFFAOYSA-N
- Chemical structure:
View 3d structure (requires JavaScript / HTML 5) - Permanent link for this species. Use this link for bookmarking this species for future reference.

Kovats' RI, non-polar column, custom temperature program

Column type | Active phase | I | Reference | Comment |
---|---|---|---|---|
Packed | SE-30 | 1840. | Francis, Morgan, et al., 1978 | N2, Chromosorb P AW DMCS; Column length: 2. m; Program: not specified |

References

Francis, Morgan, et al., 1978
Francis, A.J.; Morgan, E.D.; Poole, C.F.,
Flophemesyl Derivatives of Alcohols, Phenols, Amines and Carboxylic Acids and Their Use in Gas Chromatography with Electron-Capture Detection,
J. Chromatogr., 1978, 161, 111-117, https://doi.org/10.1016/S0021-9673(01)85218-3
. [all data]