Silane, methyl tripentyl
- Formula: C16H36Si
- Molecular weight: 256.5425
- IUPAC Standard InChIKey: KZVQFVSQDUDLQI-UHFFFAOYSA-N
- Chemical structure:
View 3d structure (requires JavaScript / HTML 5) - Permanent link for this species. Use this link for bookmarking this species for future reference.

Kovats' RI, non-polar column, isothermal

Column type | Active phase | Temperature (C) | I | Reference | Comment |
---|---|---|---|---|---|
Capillary | Apiezon L | 160. | 1529. | Peetre and Smith, 1974 |

References

Peetre and Smith, 1974
Peetre, I.-B.; Smith, B.E.F.,
Gas chromatographic investigation of organometallic compounds and their carbon analogues. IV. determination, calculation and correlation of Kováts retention indices for tetraalkylsilanes,
J. Chromatogr., 1974, 90, 1, 41-55, https://doi.org/10.1016/S0021-9673(01)94772-7
. [all data]