Hexamethyldisilazane
- Formula: C6H19NSi2
- Molecular weight: 161.3928
- IUPAC Standard InChIKey: FFUAGWLWBBFQJT-UHFFFAOYSA-N
- CAS Registry Number: 999-97-3
- Chemical structure:
View 3d structure (requires JavaScript / HTML 5) - Species with the same structure:
- Other names: Silanamine, 1,1,1-trimethyl-N-(trimethylsilyl)-; Disilazane, 1,1,1,3,3,3-hexamethyl-; Bis(trimethylsilyl)amine; 1,1,1,3,3,3-Hexamethyldisilazane; ((CH3)3Si)2NH; HMDS; OAP; Trimethyl-N-(trimethylsilyl)silanamine; 1,1,1-Trimethyl-N-(trimethylsilyl)silanamine; NSC 93895; SZ 6079; TSL 8802

Phase change data

Data compiled as indicated in comments:
BS - Robert L. Brown and Stephen E. Stein
TRC - Thermodynamics Research Center, NIST Boulder Laboratories, Chris Muzny director
AC - William E. Acree, Jr., James S. Chickos
Quantity | Value | Units | Method | Reference | Comment |
---|---|---|---|---|---|
Tboil | 399. | K | N/A | Farchan Laboratories, 1990 | BS |
Tboil | 399. | K | N/A | PCR Inc., 1990 | BS |
Tboil | 397.2 | K | N/A | Myers and Clever, 1969 | Uncertainty assigned by TRC = 0.6 K; TRC |
Quantity | Value | Units | Method | Reference | Comment |
ΔvapH° | 42.2 ± 0.9 | kJ/mol | C | Voronkov, Klyuchnikov, et al., 1991 | AC |
Enthalpy of vaporization
ΔvapH (kJ/mol) | Temperature (K) | Reference | Comment |
---|---|---|---|
36.0 | 344. | Ditsent, Skorokhodov, et al., 1972 | Based on data from 294. to 395. K.; AC |

Reaction thermochemistry data

Data compiled by: John E. Bartmess

Individual Reactions

C6H18NSi2- + Hydrogen cation = Hexamethyldisilazane

By formula: C6H18NSi2- + H+ = C6H19NSi2

Quantity Value Units Method Reference Comment
Δr1490. ± 8.8kJ/molG+TSGrimm and Bartmess, 1992gas phase
Quantity Value Units Method Reference Comment
Δr1460. ± 8.4kJ/molIMREGrimm and Bartmess, 1992gas phase

Gas phase ion energetics data

Data compiled as indicated in comments:
B - John E. Bartmess
LBLHLM - Sharon G. Lias, John E. Bartmess, Joel F. Liebman, John L. Holmes, Rhoda D. Levin, and W. Gary Mallard
LLK - Sharon G. Lias, Rhoda D. Levin, and Sherif A. Kafafi

Ionization energy determinations

IE (eV) Method Reference Comment
8.55PEMolder, Pikver, et al., 1983Vertical value; LBLHLM
8.79 ± 0.05PEHarris, Lappert, et al., 1976Vertical value; LLK
8.66PEStarzewski, Dieck, et al., 1974Vertical value; LLK

De-protonation reactions

C6H18NSi2- + Hydrogen cation = Hexamethyldisilazane

By formula: C6H18NSi2- + H+ = C6H19NSi2

Quantity Value Units Method Reference Comment
Δr1490. ± 8.8kJ/molG+TSGrimm and Bartmess, 1992gas phase; B
Quantity Value Units Method Reference Comment
Δr1460. ± 8.4kJ/molIMREGrimm and Bartmess, 1992gas phase; B

Kovats' RI, non-polar column, isothermal

View large format table.

Column type Active phase Temperature (C) I Reference Comment
PackedApolane130.686.Dutoit, 1991Column length: 3.7 m

Normal alkane RI, non-polar column, custom temperature program

View large format table.

Column type Active phase I Reference Comment
CapillaryPolydimethyl siloxanes717.Zenkevich, 2001Program: not specified

References

Farchan Laboratories, 1990
Farchan Laboratories,
Research Chemicals Catalog, Farchan Laboratories, Gainesville, FL, 1990, 91. [all data]
PCR Inc., 1990
PCR Inc.,
Research Chemicals Catalog 1990-1991, PCR Inc., Gainesville, FL, 1990, 1. [all data]
Myers and Clever, 1969
Myers, R.S.; Clever, H.L.,
Surface Tension of Octamethylcyclotetrasiloxane and Hexamethyldisilazane and Their Solutions with Carbon Tetrachloride and n-Hexadecane,
J. Chem. Eng. Data, 1969, 14, 161-164. [all data]
Voronkov, Klyuchnikov, et al., 1991
Voronkov, M.G.; Klyuchnikov, V.A.; Marenkova, L.I.; Danilova, T.F.; Shvets, G.N.; Tsvetnitskaya, S.I.; Khudobin, Yu.I.,
Thermochemistry of organosilicon compounds,
Journal of Organometallic Chemistry, 1991, 406, 1-2, 99-104, https://doi.org/10.1016/0022-328X(91)83175-4
. [all data]
Ditsent, Skorokhodov, et al., 1972
Ditsent, V.E.; Skorokhodov, I.I.; Terent'eva, N.A.; Zolotareva, M.N.,
Zh. Fiz. Khim., 1972, 46, 7, 1888. [all data]