Ethanethioic acid S-tert-butyl ester
- Formula: C6H12OS
- Molecular weight: 132.224
- IUPAC Standard InChIKey: PJFHXBBYLAVSLJ-UHFFFAOYSA-N
- CAS Registry Number: 999-90-6
- Chemical structure:
View 3d structure (requires JavaScript / HTML 5) - Species with the same structure:
- Other names: CH3C(O)SC(CH3)3; S-tert-Butyl thioacetate; t-Butyl thiolacetate

Phase change data

Data compiled as indicated in comments:
TRC - Thermodynamics Research Center, NIST Boulder Laboratories, Chris Muzny director
AC - William E. Acree, Jr., James S. Chickos
ALS - Hussein Y. Afeefy, Joel F. Liebman, and Stephen E. Stein
Quantity | Value | Units | Method | Reference | Comment |
---|---|---|---|---|---|
Tboil | 405. | K | N/A | Dunbar and Bolstad, 1955 | Uncertainty assigned by TRC = 4. K; TRC |
Quantity | Value | Units | Method | Reference | Comment |
ΔvapH° | 42.9 ± 0.2 | kJ/mol | C | Wadsö, Murto, et al., 1966 | AC |
ΔvapH° | 42.9 ± 0.2 | kJ/mol | C | Wadso, 1966 | ALS |

Reaction thermochemistry data

Data compiled by: Hussein Y. Afeefy, Joel F. Liebman, and Stephen E. Stein
Individual Reactions
By formula: H2O + C6H12OS = C2H4O2 + C4H10S
Quantity | Value | Units | Method | Reference | Comment |
---|---|---|---|---|---|
ΔrH° | -12.6 ± 0.3 | kJ/mol | Cm | Wadso, 1957 | liquid phase; Heat of hydrolysis |

References

Dunbar and Bolstad, 1955
Dunbar, R.E.; Bolstad, A.N.,
The Acetylation of Mercaptans with Ketene,
J. Am. Chem. Soc., 1955, 77, 4672. [all data]
Wadsö, Murto, et al., 1966
Wadsö, Ingemar; Murto, Maija-Leena; Bergson, Göran; Ehrenberg, L.; Brunvoll, J.; Bunnenberg, E.; Djerassi, Carl; Records, Ruth,
Heats of Vaporization for a Number of Organic Compounds at 25 degrees C.,
Acta Chem. Scand., 1966, 20, 544-552, https://doi.org/10.3891/acta.chem.scand.20-0544
. [all data]
Wadso, 1966
Wadso, I.,
Acta Chem. Scand., 1966, 20, 544. [all data]
Wadso, 1957
Wadso, I.,
The heats of hydrolysis of some alkyl thiolesters,
Acta Chem. Scand., 1957, 11, 1745-1751. [all data]