1-Methyl-1,2,3,4,-tetrahydronaphthalene-1-hydroperoxide
- Formula: C11H14O2
- Molecular weight: 178.2277
- IUPAC Standard InChIKey: BEVOTSGQUDZQKM-UHFFFAOYSA-N
- CAS Registry Number: 99964-59-7
- Chemical structure:
View 3d structure (requires JavaScript / HTML 5) - Permanent link for this species. Use this link for bookmarking this species for future reference.

Condensed phase thermochemistry data

Data compiled by: Hussein Y. Afeefy, Joel F. Liebman, and Stephen E. Stein
Quantity | Value | Units | Method | Reference | Comment |
---|---|---|---|---|---|
ΔcH°solid | -6172.2 | kJ/mol | Ccb | Hock and Knauel, 1951 | Corresponding ΔfHºsolid = -157. kJ/mol (simple calculation by NIST; no Washburn corrections) |

References

Hock and Knauel, 1951
Hock, I.H.; Knauel, G.,
Autoxydation von kohlenwasserstoffen, XIV. Mitteil. Uber die energetische stellung organischer hydroperoxyde,
Chem. Ber., 1951, 84, 1-5. [all data]