Decane, 4-chloro-
- Formula: C10H21Cl
- Molecular weight: 176.727
- IUPAC Standard InChIKey: SFSRUCSICQYPSN-UHFFFAOYSA-N
- CAS Registry Number: 999-49-5
- Chemical structure:
View 3d structure (requires JavaScript / HTML 5) - Species with the same structure:

Reaction thermochemistry data

Data compiled by: Hussein Y. Afeefy, Joel F. Liebman, and Stephen E. Stein
Individual Reactions
By formula: C10H21Cl = C10H21Cl
Quantity | Value | Units | Method | Reference | Comment |
---|---|---|---|---|---|
ΔrH° | 0.084 | kJ/mol | Ciso | Roganov, Kabo, et al., 1969 | liquid phase |

References

Roganov, Kabo, et al., 1969
Roganov, G.N.; Kabo, G.Ya.; Adreevskii, D.N.,
Additivity of thermochemical properties for isomers of secondary n-alkane chlorides (C5-C10),
J. Org. Chem. USSR (Engl. Transl.), 1969, 5, 2037-2041. [all data]