2-Butenoic acid, 3-ethoxy-, ethyl ester
- Formula: C8H14O3
- Molecular weight: 158.1950
- IUPAC Standard InChIKey: ZOCYCSPSSNMXBU-VOTSOKGWSA-N
- CAS Registry Number: 998-91-4
- Chemical structure:
View 3d structure (requires JavaScript / HTML 5) - Species with the same structure:
- Other names: Crotonic acid, 3-ethoxy-, ethyl ester; Ethyl 3-ethoxy-2-butenoate; Ethyl 3-ethoxycrotonate; 3-Ethoxy-2-butenoic acid ethyl ester; Ethyl β-ethoxy-crotonate; Ethyl 3-ethoxybut-2-enoate

Condensed phase thermochemistry data

Data compiled by: Hussein Y. Afeefy, Joel F. Liebman, and Stephen E. Stein
Quantity | Value | Units | Method | Reference | Comment |
---|---|---|---|---|---|
ΔcH°liquid | -4501.65 | kJ/mol | Ccb | Michael, 1935 | Corresponding ΔfHºliquid = -647.24 kJ/mol (simple calculation by NIST; no Washburn corrections) |

Phase change data

Data compiled by: Robert L. Brown and Stephen E. Stein
Reduced pressure boiling point
Tboil (K) | Pressure (bar) | Reference |
---|---|---|
366. to 369. | 0.027 | Frinton Laboratories Inc., 1986 |

References

Michael, 1935
Michael, A.,
On the mechanism of reactions of acetoacetic ester, the enolates and structurally related compounds. I. C- and O-alkylation,
J. Am. Chem. Soc., 1935, 57, 159-164. [all data]
Frinton Laboratories Inc., 1986
Frinton Laboratories Inc.,
Catalog Number 11, Frinton Laboratories Inc., Vineland, NJ, 1986, 99. [all data]