1,3-Cyclohexadiene, 1-methyl-4-(1-methylethyl)-
- Formula: C10H16
- Molecular weight: 136.2340
- IUPAC Standard InChIKey: YHQGMYUVUMAZJR-UHFFFAOYSA-N
- CAS Registry Number: 99-86-5
- Chemical structure:
View 3d structure (requires JavaScript / HTML 5) - Other names: α-Terpinene; α-Terpinen; p-Mentha-1,3-diene; Terpilene; 1-Isopropyl-4-methyl-1,3-cyclohexadiene; 1-methyl-4-(1-methylethyl)-1,3-cyclohexadiene; 1,3-Cyclohexadiene, 1-methyl-4-isopropyl-; 1-Methyl-4-isopropylcyclohexadiene-1,3; α-Terpine; 1-Methyl-4-isopropyl-1,3-cyclohexadiene; alpha-Terpinene; 1-Isopropyl-4-methyl-cyclohexa-1,3-diene; 1-Methyl-4-(1-methyl)-1,3-cyclohexadiene

Condensed phase thermochemistry data

Data compiled by: Hussein Y. Afeefy, Joel F. Liebman, and Stephen E. Stein
Quantity | Value | Units | Method | Reference | Comment |
---|---|---|---|---|---|
ΔcH°liquid | -5985.2 | kJ/mol | Ccb | Auwsers, Roth, et al., 1910 | Corresponding ΔfHºliquid = -236. kJ/mol (simple calculation by NIST; no Washburn corrections) |

Phase change data

Data compiled as indicated in comments:
BS - Robert L. Brown and Stephen E. Stein
TRC - Thermodynamics Research Center, NIST Boulder Laboratories, Chris Muzny director
Quantity | Value | Units | Method | Reference | Comment |
---|---|---|---|---|---|
Tboil | 447.2 | K | N/A | Aldrich Chemical Company Inc., 1990 | BS |
Tboil | 446.65 | K | N/A | Lecat, 1943 | Uncertainty assigned by TRC = 0.4 K; TRC |
Reduced pressure boiling point
Tboil (K) | Pressure (bar) | Reference | Comment |
---|---|---|---|
447.7 | 1.01 | Weast and Grasselli, 1989 | BS |

Reaction thermochemistry data

Data compiled by: Hussein Y. Afeefy, Joel F. Liebman, and Stephen E. Stein
Individual Reactions
By formula: 2H2 + C10H16 = C10H20
Quantity | Value | Units | Method | Reference | Comment |
---|---|---|---|---|---|
ΔrH° | -210.1 ± 1.3 | kJ/mol | Chyd | Dolliver, Gresham, et al., 1937 | gas phase; Reanalyzed by Cox and Pilcher, 1970, Original value = -212.2 ± 1.3 kJ/mol; At 355 °K |

Kovats' RI, polar column, custom temperature program

Data compiled by: NIST Mass Spectrometry Data Center, William E. Wallace, director

Column type CapillaryCapillary
Active phase HP-InnowaxCarbowax
Column length (m) 30.127.
Carrier gas H2
Substrate
Column diameter (mm) 0.320.75
Phase thickness (μm) 0.50
Program 60 0C (8 min) 3 K/min -> 180 0C 20 K/min -> 230 0C (20 min)not specified
I 1183.1192.
ReferenceFrizzo, Serafini, et al., 2001Okamoto, Ellison, et al., 1981
Comment MSDC-RI MSDC-RI

Normal alkane RI, polar column, temperature ramp

Data compiled by: NIST Mass Spectrometry Data Center, William E. Wallace, director

Column type CapillaryCapillaryCapillaryCapillaryCapillary
Active phase RTX-WaxHP-InnowaxDB-WaxDB-WaxDB-Wax
Column length (m) 60.30.30.15.30.
Carrier gas HeliumHeliumHeliumHeliumHelium
Substrate
Column diameter (mm) 0.220.250.250.250.25
Phase thickness (μm) 0.250.250.250.250.25
Tstart (C) 60.50.40.40.80.
Tend (C) 230.250.230.260.240.
Heat rate (K/min) 2.5.4.4.3.
Initial hold (min)  5.2.
Final hold (min) 5.10.4.55.2.
I 1158.1188.1178.1197.1191.
ReferenceBendiabdellah, El Amine Dib, et al., 2012Menichini, Tundis, et al., 2011Zeng, Xie, et al., 2011Miyazawa, Kawauchi, et al., 2010Vahirua-Lechat, Mitermite, et al., 2010
Comment MSDC-RI MSDC-RI MSDC-RI MSDC-RI MSDC-RI
Column type CapillaryCapillaryCapillaryCapillaryCapillary
Active phase Supelcowax 10RTX-WaxInnowaxHP-InnowaxHP Innowax
Column length (m) 30.60.30.30.30.
Carrier gas HeliumHeliumHeliumNitrogenHelium
Substrate
Column diameter (mm) 0.250.220.250.250.32
Phase thickness (μm) 0.250.250.250.520.50
Tstart (C) 50.60.40.35.60.
Tend (C) 200.230.250.205.260.
Heat rate (K/min) 5.2.6.3.3.
Initial hold (min)   1.10.
Final hold (min)  30.4.10.
I 1189.1156.1181.1188.1180.
ReferenceKoba, Catherine, et al., 2009Museli, Pau, et al., 2009Seo, Kim, et al., 2009Wannes, Mhamdi, et al., 2009Capetanos, Saroglou, et al., 2007
Comment MSDC-RI MSDC-RI MSDC-RI MSDC-RI MSDC-RI
Column type CapillaryCapillaryCapillaryCapillaryCapillary
Active phase HP-InnowaxCP Wax 52 CBHP-InnowaxCP-Wax 52CBTC-FFAP
Column length (m) 30.60.30.30.
Carrier gas N2HeliumHeHeHe
Substrate
Column diameter (mm) 0.250.250.250.320.25
Phase thickness (μm) 0.250.250.250.250.25
Tstart (C) 50.40.60.40.60.
Tend (C) 240.220.240.220.220.
Heat rate (K/min) 5.3.2.3.3.
Initial hold (min) 1.  1.
Final hold (min) 4. 20.2.30.
I 1183.1180.1181.1180.1190.
ReferenceCheraif, Ben Jannet, et al., 2007Chen, Chyau, et al., 2007Hachicha, Skanji, et al., 2007Hymete, Rohloff, et al., 2007Kurose, Okamura, et al., 2007
Comment MSDC-RI MSDC-RI MSDC-RI MSDC-RI MSDC-RI
Column type CapillaryCapillaryCapillaryCapillaryCapillary
Active phase TC-FFAPSupelcowax-10CarbowaxSupelcowax-10Supelcowax-10
Column length (m)  30.60.30.30.
Carrier gas HeHeHe
Substrate
Column diameter (mm) 0.250.20.250.250.25
Phase thickness (μm) 0.250.20.250.250.25
Tstart (C) 60.70.40.40.40.
Tend (C) 220.220.180.210.250.
Heat rate (K/min) 3.3.5.2.2.
Initial hold (min)
Final hold (min) 30.15. 33.33.
I 1190.1187.1191.1183.1183.
ReferenceKurose, Okamura, et al., 2007Pinto, Salgueiro, et al., 2007Singh, Kumar, et al., 2007Sylvestre, Longtin, et al., 2007Sylvestre, Pichette, et al., 2007
Comment MSDC-RI MSDC-RI MSDC-RI MSDC-RI MSDC-RI
Column type CapillaryCapillaryCapillaryCapillaryCapillary
Active phase Supelcowax-10DB-WaxInnowaxInnowaxAT-Wax
Column length (m) 30.60.30.30.60.
Carrier gas HeHeN2N2He
Substrate
Column diameter (mm) 0.250.250.250.250.25
Phase thickness (μm) 0.250.250.250.250.25
Tstart (C) 40.60.50.50.60.
Tend (C) 250.180.280.280.200.
Heat rate (K/min) 3.3.9.9.4.
Initial hold (min) 5.8.3.3.
Final hold (min) 10.80.3.3.20.
I 1177.1161.1179.1189.1190.
ReferenceVichi, Riu-Aumatell, et al., 2007Wei A. and Shibamoto T., 2007Abdelwahed, Hayder, et al., 2006Abdelwahed, Hayder, et al., 2006Borges, Rojas, et al., 2006
Comment MSDC-RI MSDC-RI MSDC-RI MSDC-RI MSDC-RI
Column type CapillaryCapillaryCapillaryCapillaryCapillary
Active phase BP-20Supelcowax 10DB-WaxBP-20BP-20
Column length (m) 50.30.60.50.50.
Carrier gas  HeliumN2HeHe
Substrate
Column diameter (mm) 0.220.200.250.220.22
Phase thickness (μm) 0.250.200.250.250.25
Tstart (C) 60.70.70.60.60.
Tend (C) 220.220.230.220.220.
Heat rate (K/min) 2.3.2.2.2.
Initial hold (min)   2.
Final hold (min) 20.15.20.20.20.
I 1182.1187.1190.1178.1178.
ReferenceBoti, Yao, et al., 2006Cavaleiro, Pinto, et al., 2006Choi, 2006Fanciullino, Tomi, et al., 2006Fanciullino, Tomi, et al., 2006
Comment MSDC-RI MSDC-RI MSDC-RI MSDC-RI MSDC-RI
Column type CapillaryCapillaryCapillaryCapillaryCapillary
Active phase HP-20MCP-Wax 52CBFFAPDB-WaxSupelcowax
Column length (m) 50.30.20.60.30.
Carrier gas HeHeHe N2
Substrate
Column diameter (mm) 0.20.320.250.250.32
Phase thickness (μm) 0.10.250.250.250.25
Tstart (C) 60.60.90.70.50.
Tend (C) 220.220.250.230.200.
Heat rate (K/min) 2.3.36.2.5.
Initial hold (min)  7. 2.
Final hold (min) 30.3. 20.
I 1153.1178.1205.1187.1186.
ReferenceFilippi, Lanfranchi, et al., 2006Hymete, Rohloff, et al., 2006Kitchlu, Bakshi, et al., 2006Lan Phi N.T., Nishiyama C., et al., 2006Martin, Joseph, et al., 2006
Comment MSDC-RI MSDC-RI MSDC-RI MSDC-RI MSDC-RI
Column type CapillaryCapillaryCapillaryCapillaryCapillary
Active phase HP-WaxHP-20MDB-InnowaxNB-20MDB-Wax
Column length (m) 30.30.60.30.60.
Carrier gas NitrogenN2HeliumHe
Substrate
Column diameter (mm) 0.250.250.250.20.25
Phase thickness (μm) 0.250.250.250.250.25
Tstart (C) 50.50.60.50.70.
Tend (C) 280.250.240.250.230.
Heat rate (K/min) 5.5.3.2.2.
Initial hold (min)     2.
Final hold (min) 5.10.20. 20.
I 1176.1176.1189.1169.1188.
ReferenceMarzouk, Mansour, et al., 2006Marzouk, Neffati, et al., 2006Mendivil, Rodrigues, et al., 2006Orav, Raal, et al., 2006Sawamura, Onishi, et al., 2006
Comment MSDC-RI MSDC-RI MSDC-RI MSDC-RI MSDC-RI
Column type CapillaryCapillaryCapillaryCapillaryCapillary
Active phase Supelcowax-10Supelcowax-10InnowaxHP-20MStabilwax
Column length (m) 30.30.50.50.30.
Carrier gas HeHeHeHeliumH2
Substrate
Column diameter (mm) 0.250.250.20.200.32
Phase thickness (μm) 0.250.250.50.200.5
Tstart (C) 50.50.60.70.40.
Tend (C) 220.250.250.250.280.
Heat rate (K/min) 4.4.2.4.6.
Initial hold (min) 1.1. 4.5.
Final hold (min) 10.10.60.10.5.
I 1174.1165.1171.1161.1187.
ReferenceWong, Lim, et al., 2006Wong, Sivasothy, et al., 2006Bendimerad and Bendiab, 2005Bezic, Skocibusic, et al., 2005Jirovetz, Buchbauer, et al., 2005
Comment MSDC-RI MSDC-RI MSDC-RI MSDC-RI MSDC-RI
Column type CapillaryCapillaryCapillaryCapillaryCapillary
Active phase HP-20MHP-20MDB-WaxDB-WaxDB-Wax
Column length (m) 50.50.30.60.60.
Carrier gas HeliumHeliumHeN2N2
Substrate
Column diameter (mm) 0.200.200.250.250.25
Phase thickness (μm) 0.200.200.250.250.25
Tstart (C) 70.70.50.70.70.
Tend (C) 180.180.180.230.230.
Heat rate (K/min) 4.4.3.2.2.
Initial hold (min) 4.4. 2.2.
Final hold (min) 10.10.40.20.20.
I 1161.1161.1167.1193.1193.
ReferenceKulisic, Radonic, et al., 2005Kulisic, Radonic, et al., 2005Lee, Umano, et al., 2005Njoroge, Koaze, et al., 2005Njoroge, Koaze, et al., 2005, 2
Comment MSDC-RI MSDC-RI MSDC-RI MSDC-RI MSDC-RI
Column type CapillaryCapillaryCapillaryCapillaryCapillary
Active phase DB-WaxSupelcowax-10Supelcowax-10BP-20RTX-Wax
Column length (m) 30.30.30.50.60.
Carrier gas He He He
Substrate
Column diameter (mm) 0.250.250.250.220.22
Phase thickness (μm) 0.250.250.250.250.25
Tstart (C) 40.40.50.60.60.
Tend (C) 250.220.220.220.230.
Heat rate (K/min) 4.3.4.2.2.
Initial hold (min)  5.3.
Final hold (min) 10.10.30.20.45.
I 1181.1177.1180.1176.1180.
ReferenceSalehi, Sonboli, et al., 2005Vichi, Riu-Aumatell, et al., 2005Wong, Lee, et al., 2005Blanc, Muselli, et al., 2004Cavalli, Tomi, et al., 2004
Comment MSDC-RI MSDC-RI MSDC-RI MSDC-RI MSDC-RI
Column type CapillaryCapillaryCapillaryCapillaryCapillary
Active phase DB-WaxDB-WaxSupelcowax-10Supelcowax-10DB-Wax
Column length (m) 60.60.60.30.60.
Carrier gas N2N2HeN2He
Substrate
Column diameter (mm) 0.250.250.20.250.25
Phase thickness (μm) 0.250.250.20.25
Tstart (C) 70.70.60.40.60.
Tend (C) 230.230.200.230.220.
Heat rate (K/min) 2.2.4.2.2.
Initial hold (min) 2.2.  4.
Final hold (min) 20.20.40.
I 1193.1194.1159.1172.1170.
ReferenceChoi, 2004Choi, 2004, 2Gauvin, Ravaomanarivo, et al., 2004González, Guerra, et al., 2004Jiang and Kubota, 2004
Comment MSDC-RI MSDC-RI MSDC-RI MSDC-RI MSDC-RI
Column type CapillaryCapillaryCapillaryCapillaryCapillary
Active phase Innowax FSCPEG-20MSupelcowax-10Supelcowax-10Innowax
Column length (m) 60.50.50.50.50.
Carrier gas Helium HeHeHe
Substrate
Column diameter (mm) 0.250.200.20.20.2
Phase thickness (μm)  0.200.250.250.2
Tstart (C) 60.40.70.70.70.
Tend (C) 220.180.230.230.220.
Heat rate (K/min) 4.3.2.2.4.
Initial hold (min) 10.5.
Final hold (min)  30.
I 1188.1178.1180.1180.1202.
ReferenceLourens, Reddy, et al., 2004Narain, Almeida, et al., 2004Orav, Stulova, et al., 2004Orav, Stulova, et al., 2004Palá-Paúl, García-Jiménez, et al., 2004
Comment MSDC-RI MSDC-RI MSDC-RI MSDC-RI MSDC-RI
Column type CapillaryCapillaryCapillaryCapillaryCapillary
Active phase NB-20MSW-10DB-WaxDB-WaxHP-Wax
Column length (m) 50.50.60.60.30.
Carrier gas HeHe NitrogenN2
Substrate
Column diameter (mm) 0.20.200.250.250.25
Phase thickness (μm) 0.250.250.250.250.25
Tstart (C) 50.50.70.70.60.
Tend (C) 250.230.230.230.220.
Heat rate (K/min) 2.2.2.2.5.
Initial hold (min)   2.2.10.
Final hold (min)   20.
I 1182.1178.1200.1200.1188.
ReferenceRaal, Arak, et al., 2004Raal, Paaver, et al., 2004Sawamura, Son, et al., 2004Sawamura, Sou, et al., 2004Bertoli, Menichini, et al., 2003
Comment MSDC-RI MSDC-RI MSDC-RI MSDC-RI MSDC-RI
Column type CapillaryCapillaryCapillaryCapillaryCapillary
Active phase DB-WaxSupelcowax-10Carbowax 20MInnowaxDB-Wax
Column length (m) 60.50.50.60.60.
Carrier gas HeliumHeHeliumHeN2
Substrate
Column diameter (mm) 0.250.20.700.250.25
Phase thickness (μm)  0.25  0.25
Tstart (C) 70.70.50.60.70.
Tend (C) 210.230.280.220.230.
Heat rate (K/min) 2.2.4.4.2.
Initial hold (min)   2.10.2.
Final hold (min) 60.  10.20.
I 1195.1180.1191.1188.1180.
ReferenceMookdasanit, Tamura, et al., 2003Orav, Kailas, et al., 2003Saura, LAencina, et al., 2003Suleimenov, Atazharova, et al., 2003Tu, Onishi, et al., 2003
Comment MSDC-RI MSDC-RI MSDC-RI MSDC-RI MSDC-RI
Column type CapillaryCapillaryCapillaryCapillaryCapillary
Active phase HP-InnowaxCarbowax 20MDB-WaxCarbowax 20MSupelcowax-10
Column length (m) 50.25.60.30.60.
Carrier gas HeN2H2HeHe
Substrate
Column diameter (mm) 0.20.250.320.250.2
Phase thickness (μm) 0.20.250.250.3250.5
Tstart (C) 70.50.40.50.70.
Tend (C) 190.250.245.215.220.
Heat rate (K/min) 5.4.1.54.2.
Initial hold (min)
Final hold (min)  10.20.20.
I 1197.1176.1167.1189.1180.
ReferenceVelasco-Negueruela, Pérez-Alonso, et al., 2003Zrira, Elamrani, et al., 2003Gancel, Ollé, et al., 2002Kasali, Winterhalter, et al., 2002Orav, Kailas, et al., 2002
Comment MSDC-RI MSDC-RI MSDC-RI MSDC-RI MSDC-RI
Column type CapillaryCapillaryCapillaryCapillaryCapillary
Active phase DB-WaxDB-WaxDB-WaxBP-20PEG-20M
Column length (m) 60.60.60.50.50.
Carrier gas N2N2HeHeHe
Substrate
Column diameter (mm) 0.250.250.250.220.2
Phase thickness (μm) 0.250.250.250.25
Tstart (C) 70.70.45.60.70.
Tend (C) 230.230.240.230.220.
Heat rate (K/min) 2.2.3.2.2.
Initial hold (min) 2.
Final hold (min) 20.  35.
I 1183.1193.1184.1179.1180.
ReferenceTu, Onishi, et al., 2002Tu, Thanh, et al., 2002Christoph, 2001Lota, de Rocca Serra, et al., 2001Orav and Kann, 2001
Comment MSDC-RI MSDC-RI MSDC-RI MSDC-RI MSDC-RI
Column type CapillaryCapillaryCapillaryCapillaryCapillary
Active phase Carbowax 20MDB-WaxSupelcowax-10BP-20DB-Wax
Column length (m) 50.30.60.25.60.
Carrier gas HeHeHeNitrogenNitrogen
Substrate
Column diameter (mm) 0.220.20.250.500.25
Phase thickness (μm) 0.25 0.250.25
Tstart (C) 60.50.60.60.40.
Tend (C) 220.180.280.200.200.
Heat rate (K/min) 2.3.4.5.2.
Initial hold (min)  8.  10.
Final hold (min)
I 1190.1169.1138.1168.1183.
ReferenceVernin, Lageot, et al., 2001Franco and Shibamoto, 2000Korány, Mednyánszky, et al., 2000Mallavarapu, Rao, et al., 2000Tamura, Boonbumrung, et al., 2000
Comment MSDC-RI MSDC-RI MSDC-RI MSDC-RI MSDC-RI
Column type CapillaryCapillaryCapillaryCapillaryCapillary
Active phase DB-WaxSupelcowax-10InnowaxDB-WaxNB-351
Column length (m) 60.30.60.60.25.
Carrier gas He HeHeH2
Substrate
Column diameter (mm) 0.250.250.250.250.3
Phase thickness (μm) 0.250.250.250.250.5
Tstart (C) 40.60.60.60.70.
Tend (C) 200.220.220.240.250.
Heat rate (K/min) 2.4. 4.5.
Initial hold (min) 2. 10. 2.
Final hold (min)
I 1176.1181.1188.1190.1204.
ReferenceUmano, Hagi, et al., 2000Choo, Wong, et al., 1999Kaya, Baser, et al., 1999Ngassoum, Yonkeu, et al., 1999Onocha, Ekundayo, et al., 1999
Comment MSDC-RI MSDC-RI MSDC-RI MSDC-RI MSDC-RI
Column type CapillaryCapillaryCapillaryCapillaryCapillary
Active phase DB-WaxBP-20DB-WaxHP-InnowaxBP-20
Column length (m) 60.25.30.60.25.
Carrier gas N2H2N2HeH2
Substrate
Column diameter (mm)  0.330.250.250.33
Phase thickness (μm) 0.250.50.250.250.5
Tstart (C) 60.80.45.50.80.
Tend (C) 220.220.220.220.220.
Heat rate (K/min) 5.5.3.5.5.
Initial hold (min)    5.
Final hold (min)
I 1191.1205.1184.1190.1205.
ReferenceWeyerstahl, Marschall, et al., 1999Bignell, Dunlop, et al., 1998Mölleken, Sinnwell, et al., 1998Stashenko, Cervantes, et al., 1998Bignell, Dunlop, et al., 1997
Comment MSDC-RI MSDC-RI MSDC-RI MSDC-RI MSDC-RI
Column type CapillaryCapillaryCapillaryCapillaryCapillary
Active phase BP-20SP-1000PEG-20MDB-WaxSupelcowax-10
Column length (m) 25.85.50.60.60.
Carrier gas H2HeHeHeHe
Substrate
Column diameter (mm) 0.330.500.250.320.25
Phase thickness (μm) 0.5  0.500.25
Tstart (C) 80.65.70.50.40.
Tend (C) 220.225.250.250.200.
Heat rate (K/min) 5.3.2.8.3.
Initial hold (min)    1.3.
Final hold (min)    6.30.
I 1205.1174.1180.1194.1176.
ReferenceBignell, Dunlop, et al., 1997, 2Brophy, Goldsack, et al., 1996Orav, Kailas, et al., 1996Sagrero-Nieves and Bartley, 1996Wong and Lai, 1996
Comment MSDC-RI MSDC-RI MSDC-RI MSDC-RI MSDC-RI
Column type CapillaryCapillaryCapillaryCapillaryCapillary
Active phase PEG-20MSupelcowax-10Supelcowax-10DB-WaxCarbowax 20M
Column length (m) 60.  60.45.
Carrier gas He  HeHydrogen
Substrate
Column diameter (mm) 0.32  0.250.32
Phase thickness (μm) 0.25  0.251.0
Tstart (C) 70.40.40.50.60.
Tend (C) 180.210.210.230.200.
Heat rate (K/min) 2.2.2.2.2.
Initial hold (min) 7.2.2.4.5.
Final hold (min)  120.120.
I 1186.1179.1179.1179.1187.
ReferenceOrav, Kuningas, et al., 1995Collin, Deslauriers, et al., 1993Collin, Deslauriers, et al., 1993Shimoda, Shiratsuchi, et al., 1993Kollmannsberger, Nitz, et al., 1992
Comment MSDC-RI MSDC-RI MSDC-RI MSDC-RI MSDC-RI
Column type CapillaryCapillaryCapillaryCapillaryCapillary
Active phase DB-WaxFFAPDB-WaxCarbowax 20MCarbowax 20M
Column length (m) 30.50.60.150.25.
Carrier gas   He
Substrate
Column diameter (mm) 0.32 0.3220.660.30
Phase thickness (μm)   0.25
Tstart (C) 70.50.50.60.40.
Tend (C) 200.180.230.170.220.
Heat rate (K/min) 4.10.4.1.2.
Initial hold (min) 2.1. 40.5.
Final hold (min)
I 1193.1187.1178.1165.1180.
ReferenceWyllie, Brophy, et al., 1990Brophy, Davies, et al., 1989Engel, Flath, et al., 1988Buttery, Ling, et al., 1987Nykanen, 1986
Comment MSDC-RI MSDC-RI MSDC-RI MSDC-RI MSDC-RI
Column type CapillaryCapillaryCapillaryPacked
Active phase Carbowax 20MCarbowax 20MCarbowax 20MCarbowax 20M
Column length (m) 50.50.50.2.
Carrier gas  N2N2Hydrogen
Substrate    Gas-Chrom Z (80-100 mesh)
Column diameter (mm) 0.320.280.28
Phase thickness (μm)
Tstart (C) 70.80.80.65.
Tend (C) 180.170.170.220.
Heat rate (K/min) 2.1.1.4.
Initial hold (min)
Final hold (min)
I 1181.1157.1157.1198.
ReferenceEngel and Tressl, 1983Yamaguchi and Shibamoto, 1980Yamaguchi and Shibamoto, 1980Stancher and Pertoldi, 1967
Comment MSDC-RI MSDC-RI MSDC-RI MSDC-RI

Van Den Dool and Kratz RI, non-polar column, custom temperature program

Data compiled by: NIST Mass Spectrometry Data Center, William E. Wallace, director

Column type CapillaryCapillaryCapillaryCapillaryCapillary
Active phase VF-5MSBPX-5SE-52DB-5SE-52
Column length (m) 30.30.30.30.30.
Carrier gas He HeHeHe
Substrate
Column diameter (mm) 0.250.250.320.320.32
Phase thickness (μm) 0.250.250.150.250.15
Program 40C(2min) => 5C/min => 200C (2min) => 30C/min => 260C35C(5min) => 3C/min => 210C => 40C/min => 240C (4min)45C => 1C/min => 100C => 5C/min => 250C (10min)40C(3min) => 3C/min => 180C => 10C/min => 260C(2min)45C => 1C/min => 100C => 5C/min => 250C(10min)
I 1011.1025.1015.1007.1017.
ReferenceCarasek and Pawliszyn, 2006Cardeal, da Silva, et al., 2006Guerrini, Sacchetti, et al., 2006Moon, Cliff, et al., 2006Sacchetti, Guerrini, et al., 2006
Comment MSDC-RI MSDC-RI MSDC-RI MSDC-RI MSDC-RI
Column type CapillaryCapillaryCapillaryCapillaryCapillary
Active phase DB-1HP-5MSSE-52HP-5SE-52
Column length (m) 30.30.30.30.25.
Carrier gas HeHeHeHeH2
Substrate    Chromosorb W
Column diameter (mm) 0.250.250.320.320.32
Phase thickness (μm) 0.250.250.150.250.43
Program 35C => 2C/min => 200C => 5C/min => 240C50C (3min) => 3C/min => 200C => 6C/min => 240C45C => 1C/min => 100C => 5C/min => 250C(10min)80 0C 8 K/min -> 150 0C 5 K/min -> 230 0C (10 min)60C(8min) => 3C/min => 180C => 20C/min => 250C(10min)
I 1000.1017.1017.1015.1014.
ReferenceSuliman F.E.O., Fatope M.O., et al., 2006Akpulat, Tepe, et al., 2005Bruni, Pellati, et al., 2005Gopanraj, Dan, et al., 2005Lorenzo, Paz, et al., 2005
Comment MSDC-RI MSDC-RI MSDC-RI MSDC-RI MSDC-RI
Column type CapillaryCapillaryCapillaryCapillaryCapillary
Active phase CBP-55 % Phenyl methyl siloxaneDB-5MSSE-52HP-5
Column length (m) 30.30.30.25.50.
Carrier gas HeHeHeH2He
Substrate
Column diameter (mm) 0.250.320.250.320.2
Phase thickness (μm) 0.250.150.250.430.5
Program 60C => 3C/min => 240C => 10C/min => 280C(10min)45C => 1C/min => 100C => 5C/min => 250C (10min)40 (5min) => 4C/min => 140C => 4C/min => 200C (20min)60C(8min) => 3C/min => 180C => 20C/min => 250C(10min)40C(3min) => 10C/min => 60C =3C/min => 150C => 20C/min => 250C (5min)
I 1013.1017.1015.1015.994.
ReferenceOliveira, Campos, et al., 2005Sacchetti, Maietti, et al., 2005Zheng, Kim, et al., 2005Frizzo, Lorenzo, et al., 2004Boué, Shih, et al., 2003
Comment MSDC-RI MSDC-RI MSDC-RI MSDC-RI MSDC-RI
Column type CapillaryCapillaryCapillaryCapillaryCapillary
Active phase DB-5MSSE-52CP Sil 8 CBCBP-5BP-1
Column length (m) 30.25.50.50.50.
Carrier gas HeHeHeHe
Substrate
Column diameter (mm) 0.250.250.320.250.22
Phase thickness (μm) 0.250.25 0.250.25
Program 40C(5min) => 4C/min => 160C => 8C/min => 240C (15min)60C(8min) => 3C/min => 180C => 20C/min => 230C60C (2min) => 5C/min => 160C (1min) => 10C/min => 250C (2min)60C(2min) => 3C/min => 240C => 10C/min => 280C(10min)not specified
I 1013.1013.1018.1014.1011.
ReferenceKim, Lee, et al., 2003Lorenzo, Loayza, et al., 2003Mockute and Judzentiene, 2003Azevedo, Campos, et al., 2002Cavalli, Ranarivelo, et al., 2001
Comment MSDC-RI MSDC-RI MSDC-RI MSDC-RI MSDC-RI
Column type CapillaryCapillaryCapillaryCapillaryCapillary
Active phase DB-1BP-1SE-52SE-54SE-54
Column length (m) 60. 25.30.30.
Carrier gas He HeHeHe
Substrate
Column diameter (mm) 0.25 0.250.320.32
Phase thickness (μm) 0.25 0.250.250.25
Program -20C (5min) => 10C/min => 100C => 4C/min => 200C => 10C/min => 280Cnot specified60 0C (8 min) 3 K/min -> 180 0C 20 K/min -> 230 0C35C (2min) => 40C/min => 60C (2min) => 6C/min => 180C => 10C/min => 230C (5min)35 0C 40 0C/min -> 60 0C (2 min) 6 0C/min -> 180 0C 10 0C/min -> 230 0C
I 1013.1010.1016.1025.1025.
ReferenceEri, Khoo, et al., 2000Filippini, Tomi, et al., 2000Loayza, de Groot, et al., 1999Tairu, Hofmann, et al., 1999Tairu, Hofmann, et al., 1999, 2
Comment MSDC-RI MSDC-RI MSDC-RI MSDC-RI MSDC-RI
Column type Capillary
Active phase SE-52
Column length (m) 60.
Carrier gas He
Substrate
Column diameter (mm) 0.32
Phase thickness (μm) 0.40
Program 45 C (6 min) 3 C/min -> 111 0C 2 C/min -> 160 C 3 C/min -> 300 C (15 min)
I 1017.
ReferenceMondello, Dugo, et al., 1995
Comment MSDC-RI

References

Auwsers, Roth, et al., 1910
Auwsers, K.; Roth, W.A.; Eisenlohr, F.,
III. Verbrennungswarmen von Terpenen und Styrolen,
Justus Liebigs Ann. Chem., 1910, 267-290. [all data]
Aldrich Chemical Company Inc., 1990
Aldrich Chemical Company Inc.,
Catalog Handbook of Fine Chemicals, Aldrich Chemical Company, Inc., Milwaukee WI, 1990, 1. [all data]
Lecat, 1943
Lecat, M.,
Azeotropes of Ethyl Urethane and other Azeotropes,
C. R. Hebd. Seances Acad. Sci., 1943, 217, 273. [all data]
Weast and Grasselli, 1989
CRC Handbook of Data on Organic Compounds, 2nd Editon, Weast,R.C and Grasselli, J.G., ed(s)., CRC Press, Inc., Boca Raton, FL, 1989, 1. [all data]
Dolliver, Gresham, et al., 1937
Dolliver, M.a.; Gresham, T.L.; Kistiakowsky, G.B.; Vaughan, W.E.,
Heats of organic reactions. V. Heats of hydrogenation of various hydrocarbons,
J. Am. Chem. Soc., 1937, 59, 831-841. [all data]
Cox and Pilcher, 1970
Cox, J.D.; Pilcher, G.,
Thermochemistry of Organic and Organometallic Compounds, Academic Press, New York, 1970, 1-636. [all data]