γ-Terpinene
- Formula: C10H16
- Molecular weight: 136.2340
- IUPAC Standard InChIKey: YKFLAYDHMOASIY-UHFFFAOYSA-N
- CAS Registry Number: 99-85-4
- Chemical structure:
View 3d structure (requires JavaScript / HTML 5) - Other names: 1,4-Cyclohexadiene, 1-methyl-4-(1-methylethyl)-; γ-Terpinen; p-Mentha-1,4-diene; Crithmene; Moslene; 1-methyl-4-(1-methylethyl)-1,4-cyclohexadiene; 1-Methyl-4-isopropyl-1,4-cyclohexadiene; 1-Methyl-4-isopropylcyclohexadiene-1,4; 1,4-p-Menthadiene; 1,4-Cyclohexadiene, 1-methyl-4-isopropyl-; 4-Isopropyl-1-methyl-1,4-cyclohexadiene; Terpinene, γ-; 1-Isopropyl-4-methyl-cyclohexa-1,4-diene; NSC 21448; 1-isopropyl-4-methyl-1,4-cyclohexadiene (γ-terpinene); γ-Terpinolene; Gamma-terpinene

Phase change data

Data compiled as indicated in comments:
BS - Robert L. Brown and Stephen E. Stein
TRC - Thermodynamics Research Center, NIST Boulder Laboratories, Chris Muzny director
AC - William E. Acree, Jr., James S. Chickos
Quantity | Value | Units | Method | Reference | Comment |
---|---|---|---|---|---|
Tboil | 456.2 | K | N/A | Weast and Grasselli, 1989 | BS |
Tboil | 456.15 | K | N/A | Lecat, 1943 | Uncertainty assigned by TRC = 0.4 K; TRC |
Quantity | Value | Units | Method | Reference | Comment |
ΔvapH° | 51.4 | kJ/mol | GC | Hoskovec, Grygarová, et al., 2005 | Based on data from 313. to 413. K.; AC |

Normal alkane RI, polar column, temperature ramp

Data compiled by: NIST Mass Spectrometry Data Center, William E. Wallace, director

Column type CapillaryCapillaryCapillaryCapillaryCapillary
Active phase RTX-WaxBP-20HP-InnowaxRTX-WaxDB-Wax
Column length (m) 60.50.30.60.30.
Carrier gas HeliumHeliumHeliumHeliumHelium
Substrate
Column diameter (mm) 0.220.220.250.220.25
Phase thickness (μm) 0.250.250.250.250.25
Tstart (C) 60.60.50.60.80.
Tend (C) 230.220.250.230.240.
Heat rate (K/min) 2.2.5.2.3.
Initial hold (min)   5.
Final hold (min) 5.20.10.30.2.
I 1239.1244.1255.1228.1252.
ReferenceBendiabdellah, El Amine Dib, et al., 2012Yapi, Boti, et al., 2012Menichini, Tundis, et al., 2011Dib, Djabou, et al., 2010Vahirua-Lechat, Mitermite, et al., 2010
Comment MSDC-RI MSDC-RI MSDC-RI MSDC-RI MSDC-RI
Column type CapillaryCapillaryCapillaryCapillaryCapillary
Active phase Supelcowax 10RTX-WaxInnowaxHP-InnowaxHP Innowax
Column length (m) 30.60.30.30.30.
Carrier gas HeliumHeliumHeliumNitrogenHelium
Substrate
Column diameter (mm) 0.250.220.250.250.32
Phase thickness (μm) 0.250.250.250.520.50
Tstart (C) 50.60.40.35.60.
Tend (C) 200.230.250.205.260.
Heat rate (K/min) 5.2.6.3.3.
Initial hold (min)   1.10.
Final hold (min)  30.4.10.
I 1252.1220.1248.1255.1243.
ReferenceKoba, Catherine, et al., 2009Museli, Pau, et al., 2009Seo, Kim, et al., 2009Wannes, Mhamdi, et al., 2009Capetanos, Saroglou, et al., 2007
Comment MSDC-RI MSDC-RI MSDC-RI MSDC-RI MSDC-RI
Column type CapillaryCapillaryCapillaryCapillaryCapillary
Active phase HP-InnowaxCP Wax 52 CBCP-Wax 52CBCarbowaxCarbowax
Column length (m) 30.60.60.60.60.
Carrier gas N2HeliumHeHeHe
Substrate
Column diameter (mm) 0.250.250.250.20.2
Phase thickness (μm) 0.250.250.250.250.25
Tstart (C) 50.40.40.60.60.
Tend (C) 240.220.220.250.250.
Heat rate (K/min) 5.3.3.2.2.
Initial hold (min) 1.  8.8.
Final hold (min) 4.  15.15.
I 1236.1245.1256.1285.1250.
ReferenceCheraif, Ben Jannet, et al., 2007Chen, Chyau, et al., 2007Chyau, Tsai, et al., 2007Ferhat, Meklati, et al., 2007Ferhat, Tigrine-Kordjani, et al., 2007
Comment MSDC-RI MSDC-RI MSDC-RI MSDC-RI MSDC-RI
Column type CapillaryCapillaryCapillaryCapillaryCapillary
Active phase HP-InnowaxCP-Wax 52CBTC-FFAPTC-FFAPDB-Wax
Column length (m) 30.30.  60.
Carrier gas HeHeHeHeHe
Substrate
Column diameter (mm) 0.250.320.250.250.32
Phase thickness (μm) 0.250.250.250.250.25
Tstart (C) 60.40.60.60.70.
Tend (C) 240.220.220.220.220.
Heat rate (K/min) 2.3.3.3.4.
Initial hold (min)  1.
Final hold (min) 20.2.30.30.
I 1245.1250.1256.1256.1240.
ReferenceHachicha, Skanji, et al., 2007Hymete, Rohloff, et al., 2007Kurose, Okamura, et al., 2007Kurose, Okamura, et al., 2007Pala-Paul, Brophy, et al., 2007
Comment MSDC-RI MSDC-RI MSDC-RI MSDC-RI MSDC-RI
Column type CapillaryCapillaryCapillaryCapillaryCapillary
Active phase Supelcowax-10CP-Wax 52CBSupelcowax-10CarbowaxSupelcowax-10
Column length (m) 30.60.30.60.30.
Carrier gas HeHeHeHe
Substrate
Column diameter (mm) 0.20.320.250.250.25
Phase thickness (μm) 0.20.50.250.250.25
Tstart (C) 70.40.50.40.40.
Tend (C) 220.220.250.180.210.
Heat rate (K/min) 3.4.2.5.2.
Initial hold (min)  8.
Final hold (min) 15.20.  33.
I 1248.1253.1240.1239.1255.
ReferencePinto, Salgueiro, et al., 2007Povolo, Contarini, et al., 2007Raal, Orav, et al., 2007Singh, Kumar, et al., 2007Sylvestre, Longtin, et al., 2007
Comment MSDC-RI MSDC-RI MSDC-RI MSDC-RI MSDC-RI
Column type CapillaryCapillaryCapillaryCapillaryCapillary
Active phase Supelcowax-10Supelcowax-10DB-WaxInnowaxInnowax
Column length (m) 30.30.60.30.30.
Carrier gas  HeHeN2N2
Substrate
Column diameter (mm) 0.250.250.250.250.25
Phase thickness (μm) 0.250.250.250.250.25
Tstart (C) 40.40.60.50.50.
Tend (C) 250.250.180.280.280.
Heat rate (K/min) 2.3.3.9.9.
Initial hold (min)  5.8.3.3.
Final hold (min) 33.10.80.3.3.
I 1269.1244.1224.1244.1256.
ReferenceSylvestre, Pichette, et al., 2007Vichi, Riu-Aumatell, et al., 2007Wei A. and Shibamoto T., 2007Abdelwahed, Hayder, et al., 2006Abdelwahed, Hayder, et al., 2006
Comment MSDC-RI MSDC-RI MSDC-RI MSDC-RI MSDC-RI
Column type CapillaryCapillaryCapillaryCapillaryCapillary
Active phase AT-WaxBP-20Supelcowax 10DB-WaxBP-20
Column length (m) 60.50.30.60.50.
Carrier gas HeHeHeliumHeHe
Substrate
Column diameter (mm) 0.250.220.200.250.22
Phase thickness (μm) 0.250.250.200.250.25
Tstart (C) 60.60.70.70.60.
Tend (C) 200.220.220.230.220.
Heat rate (K/min) 4.2.3.2.2.
Initial hold (min)    2.
Final hold (min) 20.20.15.20.20.
I 1250.1242.1249.1261.1243.
ReferenceBorges, Rojas, et al., 2006Boti, Muselli, et al., 2006Cavaleiro, Pinto, et al., 2006Choi H.S., 2006Fanciullino, Tomi, et al., 2006
Comment MSDC-RI MSDC-RI MSDC-RI MSDC-RI MSDC-RI
Column type CapillaryCapillaryCapillaryCapillaryCapillary
Active phase BP-20HP-20MCP-Wax 52CBDB-Wax EtrFFAP
Column length (m) 50.50.30.60.20.
Carrier gas HeHeHeHeHe
Substrate
Column diameter (mm) 0.220.20.320.250.25
Phase thickness (μm) 0.250.10.250.250.25
Tstart (C) 60.60.60.40.90.
Tend (C) 220.220.220.230.250.
Heat rate (K/min) 2.2.3.32.6.
Initial hold (min)   7.5.
Final hold (min) 20.30.3.100.
I 1243.1219.1245.1270.1271.
ReferenceFanciullino, Tomi, et al., 2006Filippi, Lanfranchi, et al., 2006Hymete, Rohloff, et al., 2006Ibarz, Ferreira, et al., 2006Kitchlu, Bakshi, et al., 2006
Comment MSDC-RI MSDC-RI MSDC-RI MSDC-RI MSDC-RI
Column type CapillaryCapillaryCapillaryCapillaryCapillary
Active phase DB-WaxSupelcowaxDB-InnowaxNB-20MDB-Wax
Column length (m) 60.30.60.30.60.
Carrier gas  N2HeliumHe
Substrate
Column diameter (mm) 0.250.320.250.20.25
Phase thickness (μm) 0.250.250.250.250.25
Tstart (C) 70.50.60.50.70.
Tend (C) 230.200.240.250.230.
Heat rate (K/min) 2.5.3.2.2.
Initial hold (min) 2.   2.
Final hold (min) 20. 20. 20.
I 1254.1255.1251.1237.1255.
ReferenceLan Phi N.T., Nishiyama C., et al., 2006Martin, Joseph, et al., 2006Mendivil, Rodrigues, et al., 2006Orav, Raal, et al., 2006Sawamura, Onishi, et al., 2006
Comment MSDC-RI MSDC-RI MSDC-RI MSDC-RI MSDC-RI
Column type CapillaryCapillaryCapillaryCapillaryCapillary
Active phase Carbowax-PEGSupelcowax-10Supelcowax-10InnowaxHP-20M
Column length (m) 60.30.30.50.50.
Carrier gas HeliumHeHeHeHelium
Substrate
Column diameter (mm) 0.200.250.250.20.20
Phase thickness (μm) 0.250.250.250.50.20
Tstart (C) 60.50.50.60.70.
Tend (C) 250.220.250.250.250.
Heat rate (K/min) 2.4.4.2.4.
Initial hold (min) 8.1.1. 4.
Final hold (min) 15.10.10.60.10.
I 1250.1242.1254.1235.1231.
ReferenceTigrine-Kordiani, Meklati, et al., 2006Wong, Lim, et al., 2006Wong, Sivasothy, et al., 2006Bendimerad and Bendiab, 2005Bezic, Skocibusic, et al., 2005
Comment MSDC-RI MSDC-RI MSDC-RI MSDC-RI MSDC-RI
Column type CapillaryCapillaryCapillaryCapillaryCapillary
Active phase StabilwaxCarbowax 20MHP-20MHP-20MDB-Wax
Column length (m) 30.25.50.50.30.
Carrier gas H2H2HeliumHeliumHe
Substrate
Column diameter (mm) 0.320.530.200.200.25
Phase thickness (μm) 0.52.00.200.200.25
Tstart (C) 40.40.70.70.50.
Tend (C) 280.210.180.180.180.
Heat rate (K/min) 6.5.4.4.3.
Initial hold (min) 5.3.4.4.
Final hold (min) 5.10.10.10.40.
I 1247.1212.1231.1231.1233.
ReferenceJirovetz, Buchbauer, et al., 2005Krings, Brauer, et al., 2005Kulisic, Radonic, et al., 2005Kulisic, Radonic, et al., 2005Lee, Umano, et al., 2005
Comment MSDC-RI MSDC-RI MSDC-RI MSDC-RI MSDC-RI
Column type CapillaryCapillaryCapillaryCapillaryCapillary
Active phase DB-WaxDB-WaxDB-WaxCP-Wax 52CBDB-Wax
Column length (m) 60.60.60.30.30.
Carrier gas N2N2NitrogenHeHe
Substrate
Column diameter (mm) 0.250.250.320.320.25
Phase thickness (μm) 0.250.250.500.250.25
Tstart (C) 70.70.35.40.40.
Tend (C) 230.230.235.220.250.
Heat rate (K/min) 2.2.2.4.4.
Initial hold (min) 2.2.4.1.
Final hold (min) 20.20.30. 10.
I 1266.1266.1262.1245.1208.
ReferenceNjoroge, Koaze, et al., 2005Njoroge, Koaze, et al., 2005, 2Qian and Wang, 2005Rohloff and Bones, 2005Salehi, Sonboli, et al., 2005
Comment MSDC-RI MSDC-RI MSDC-RI MSDC-RI MSDC-RI
Column type CapillaryCapillaryCapillaryCapillaryCapillary
Active phase Supelcowax-10Supelcowax-10DB-WaxBP-20RTX-Wax
Column length (m) 30.30.30.50.60.
Carrier gas  HeHe He
Substrate
Column diameter (mm) 0.250.250.250.220.22
Phase thickness (μm) 0.250.250.250.250.25
Tstart (C) 40.50.90.60.60.
Tend (C) 220.220.220.220.230.
Heat rate (K/min) 3.4.7.2.2.
Initial hold (min) 5.3.2.
Final hold (min) 10.30.5.20.45.
I 1244.1251.1273.1239.1241.
ReferenceVichi, Riu-Aumatell, et al., 2005Wong, Lee, et al., 2005Agnihotri, Thappa, et al., 2004Blanc, Muselli, et al., 2004Cavalli, Tomi, et al., 2004
Comment MSDC-RI MSDC-RI MSDC-RI MSDC-RI MSDC-RI
Column type CapillaryCapillaryCapillaryCapillaryCapillary
Active phase DB-WaxDB-WaxDB-WaxInnowax FSCSupelcowax-10
Column length (m) 60.60.60.60.50.
Carrier gas N2N2HeHeliumHe
Substrate
Column diameter (mm) 0.250.250.250.250.2
Phase thickness (μm) 0.250.25  0.25
Tstart (C) 70.70.60.60.70.
Tend (C) 230.230.220.220.230.
Heat rate (K/min) 2.2.2.4.2.
Initial hold (min) 2.2.4.10.
Final hold (min) 20.20.
I 1267.1257.1248.1255.1246.
ReferenceChoi, 2004Choi, 2004, 2Jiang and Kubota, 2004Lourens, Reddy, et al., 2004Orav, Stulova, et al., 2004
Comment MSDC-RI MSDC-RI MSDC-RI MSDC-RI MSDC-RI
Column type CapillaryCapillaryCapillaryCapillaryCapillary
Active phase Supelcowax-10InnowaxNB-20MSW-10DB-Wax
Column length (m) 50.50.50.50.60.
Carrier gas HeHeHeHe
Substrate
Column diameter (mm) 0.20.20.20.200.25
Phase thickness (μm) 0.250.20.250.250.25
Tstart (C) 70.70.50.50.70.
Tend (C) 230.220.250.230.230.
Heat rate (K/min) 2.4.2.2.2.
Initial hold (min)     2.
Final hold (min)     20.
I 1246.1269.1240.1246.1270.
ReferenceOrav, Stulova, et al., 2004Palá-Paúl, García-Jiménez, et al., 2004Raal, Arak, et al., 2004Raal, Paaver, et al., 2004Sawamura, Son, et al., 2004
Comment MSDC-RI MSDC-RI MSDC-RI MSDC-RI MSDC-RI
Column type CapillaryCapillaryCapillaryCapillaryCapillary
Active phase DB-WaxHP-WaxSupelcowax-10HP-20MDB-Wax
Column length (m) 60.30.30.50.60.
Carrier gas NitrogenN2HeHeHelium
Substrate
Column diameter (mm) 0.250.250.250.20.25
Phase thickness (μm) 0.250.250.250.2
Tstart (C) 70.60.60.70.70.
Tend (C) 230.220.240.180.210.
Heat rate (K/min) 2.5.4.4.2.
Initial hold (min) 2.10. 4.
Final hold (min)    10.60.
I 1270.1253.1243.1236.1250.
ReferenceSawamura, Sou, et al., 2004Bertoli, Menichini, et al., 2003Cabanillas, Lopez, et al., 2003Juteau, Jerkovic, et al., 2003Mookdasanit, Tamura, et al., 2003
Comment MSDC-RI MSDC-RI MSDC-RI MSDC-RI MSDC-RI
Column type CapillaryCapillaryCapillaryCapillaryCapillary
Active phase Supelcowax-10SW-10Supelcowax-10HP-InnowaxInnowax
Column length (m) 50.50.30.50.60.
Carrier gas HeHeN2 He
Substrate
Column diameter (mm) 0.20.200.250.20.25
Phase thickness (μm) 0.250.250.250.2
Tstart (C) 70.50.40.50.60.
Tend (C) 230.250.230.220.220.
Heat rate (K/min) 2.2.2.4.4.
Initial hold (min)    5.10.
Final hold (min)     10.
I 1246.1246.1255.1253.1255.
ReferenceOrav, Kailas, et al., 2003Raal, Arak, et al., 2003Rotman, Ahumada, et al., 2003Stashenko, Jaramillo, et al., 2003Suleimenov, Atazharova, et al., 2003
Comment MSDC-RI MSDC-RI MSDC-RI MSDC-RI MSDC-RI
Column type CapillaryCapillaryCapillaryCapillaryCapillary
Active phase HP-InnowaxCarbowax 20MDB-WaxSupelcowax-10DB-Wax
Column length (m) 50.25.60.60.60.
Carrier gas HeN2H2HeN2
Substrate
Column diameter (mm) 0.20.250.320.20.25
Phase thickness (μm) 0.20.250.250.50.25
Tstart (C) 70.50.40.70.70.
Tend (C) 190.250.245.220.230.
Heat rate (K/min) 5.4.1.52.2.
Initial hold (min)     2.
Final hold (min)  10.20. 20.
I 1257.1250.1235.1246.1250.
ReferenceVelasco-Negueruela, Pérez-Alonso, et al., 2003Zrira, Elamrani, et al., 2003Gancel, Ollé, et al., 2002Orav, Kailas, et al., 2002Tu, Onishi, et al., 2002
Comment MSDC-RI MSDC-RI MSDC-RI MSDC-RI MSDC-RI
Column type CapillaryCapillaryCapillaryCapillaryCapillary
Active phase DB-WaxDB-WaxDB-WaxDB-WaxBP-20
Column length (m) 60.60.60.60.50.
Carrier gas N2HeHeHeHe
Substrate
Column diameter (mm) 0.250.250.250.250.22
Phase thickness (μm) 0.250.250.25 0.25
Tstart (C) 70.40.45.40.60.
Tend (C) 230.200.240.220.230.
Heat rate (K/min) 2.2.3.2.2.
Initial hold (min)  2.
Final hold (min)     35.
I 1264.1228.1251.1240.1241.
ReferenceTu, Thanh, et al., 2002Umano, Hagi, et al., 2002Christoph, 2001Jiang and Kubota, 2001Lota, de Rocca Serra, et al., 2001
Comment MSDC-RI MSDC-RI MSDC-RI MSDC-RI MSDC-RI
Column type CapillaryCapillaryCapillaryCapillaryCapillary
Active phase PEG-20MPEG-20MDB-WaxCP-Wax 52CBDB-Wax
Column length (m) 50.50.60.50.30.
Carrier gas HeHe HeHe
Substrate
Column diameter (mm) 0.20.20.250.300.2
Phase thickness (μm)   0.250.25
Tstart (C) 70.70.30.40.50.
Tend (C) 250.220.170.220.180.
Heat rate (K/min) 2.2.2.3.3.
Initial hold (min)   4.5.8.
Final hold (min)   30.
I 1243.1246.1241.1248.1238.
ReferenceOrav, Kailas, et al., 2001Orav and Kann, 2001Buttery, Light, et al., 2000Chagonda, Makanda, et al., 2000Franco and Shibamoto, 2000
Comment MSDC-RI MSDC-RI MSDC-RI MSDC-RI MSDC-RI
Column type CapillaryCapillaryCapillaryCapillaryCapillary
Active phase Supelcowax-10BP-20HP-20MDB-WaxDB-Wax
Column length (m) 60.25.50.60.60.
Carrier gas HeNitrogenHeNitrogenHe
Substrate
Column diameter (mm) 0.250.500.200.250.25
Phase thickness (μm) 0.250.250.20 0.25
Tstart (C) 60.60.70.40.40.
Tend (C) 280.200.180.200.200.
Heat rate (K/min) 4.5.4.2.2.
Initial hold (min)   4.10.2.
Final hold (min)
I 1238.1227.1231.1258.1243.
ReferenceKorány, Mednyánszky, et al., 2000Mallavarapu, Rao, et al., 2000Mastelic, Milos, et al., 2000Tamura, Boonbumrung, et al., 2000Umano, Hagi, et al., 2000
Comment MSDC-RI MSDC-RI MSDC-RI MSDC-RI MSDC-RI
Column type CapillaryCapillaryCapillaryCapillaryCapillary
Active phase CW 20MSupelcowax-10BP-20HP Innowax FSPInnowax
Column length (m) 25.30.25.60.60.
Carrier gas Hydrogen  HeHe
Substrate
Column diameter (mm) 0.320.250.330.250.25
Phase thickness (μm) 0.250.250.50.250.25
Tstart (C) 50.60.80.60.60.
Tend (C) 220.220.220.220.220.
Heat rate (K/min) 3.4.5.
Initial hold (min) 1.  10.10.
Final hold (min) 10.  10.
I 1235.1248.1266.1255.1255.
ReferenceBicchi, Binello, et al., 1999Choo, Wong, et al., 1999Dunlop, Bignell, et al., 1999Kaya, Baser, et al., 1999Kaya, Baser, et al., 1999, 2
Comment MSDC-RI MSDC-RI MSDC-RI MSDC-RI MSDC-RI
Column type CapillaryCapillaryCapillaryCapillaryCapillary
Active phase Supelcowax-10CarbowaxFFAPDB-WaxNB-351
Column length (m) 30.50.25.60.25.
Carrier gas HeN2HeHeH2
Substrate
Column diameter (mm) 0.250.20.20.250.3
Phase thickness (μm)    0.250.5
Tstart (C) 60.80.70.60.70.
Tend (C) 240.200.210.240.250.
Heat rate (K/min) 4.1.3.4.5.
Initial hold (min)   10. 2.
Final hold (min)  20.
I 1243.1251.1274.1244.1273.
ReferenceLabuckas, Zygadlo, et al., 1999Menon, Chacko, et al., 1999Mockute and Bernotiene, 1999Ngassoum, Yonkeu, et al., 1999Onocha, Ekundayo, et al., 1999
Comment MSDC-RI MSDC-RI MSDC-RI MSDC-RI MSDC-RI
Column type CapillaryCapillaryCapillaryCapillaryCapillary
Active phase HP-20MDB-WaxDB-WaxBP-20DB-Wax
Column length (m) 25.60.60.25.30.
Carrier gas HeliumHeN2H2N2
Substrate
Column diameter (mm) 0.200.25 0.330.25
Phase thickness (μm) 0.250.250.250.50.25
Tstart (C) 60.40.60.80.45.
Tend (C) 200.200.220.220.220.
Heat rate (K/min) 3.2.5.5.3.
Initial hold (min) 4.2.
Final hold (min)
I 1251.1240.1258.1266.1234.
ReferencePrikhod'ko, Klyuev, et al., 1999Umano, Nakahara, et al., 1999Weyerstahl, Marschall, et al., 1999Bignell, Dunlop, et al., 1998Molleken U., Sinnwell V., et al., 1998
Comment MSDC-RI MSDC-RI MSDC-RI MSDC-RI MSDC-RI
Column type CapillaryCapillaryCapillaryCapillaryCapillary
Active phase DB-WaxHP-InnowaxHP-Innowax FSCBP-20BP-20
Column length (m) 30.60.60.25.25.
Carrier gas N2HeHeH2H2
Substrate
Column diameter (mm) 0.250.250.250.330.33
Phase thickness (μm) 0.250.250.250.50.5
Tstart (C) 45.50.60.80.80.
Tend (C) 220.220.220.220.220.
Heat rate (K/min) 3.5.4.5.5.
Initial hold (min)  5.10.
Final hold (min)   10.
I 1251.1231.1255.1266.1266.
ReferenceMölleken, Sinnwell, et al., 1998Stashenko, Cervantes, et al., 1998Tümen, Baser, et al., 1998Bignell, Dunlop, et al., 1997Bignell, Dunlop, et al., 1997, 2
Comment MSDC-RI MSDC-RI MSDC-RI MSDC-RI MSDC-RI
Column type CapillaryCapillaryCapillaryCapillaryCapillary
Active phase BP-20BP-20BP-20BP-20Supelcowax-10
Column length (m) 25.25.25.25.30.
Carrier gas H2H2 H2
Substrate
Column diameter (mm) 0.330.330.330.330.25
Phase thickness (μm) 0.50.50.50.5
Tstart (C) 80.80.80.80.60.
Tend (C) 220.220.220.220.240.
Heat rate (K/min) 5.5.5.5.4.
Initial hold (min)
Final hold (min)
I 1266.1266.1266.1266.1293.
ReferenceBignell, Dunlop, et al., 1997, 3Bignell, Dunlop, et al., 1997, 4Bignell, Dunlop, et al., 1997, 5Bignell, Dunlop, et al., 1997, 6Zunino, Novillo-Newton, et al., 1997
Comment MSDC-RI MSDC-RI MSDC-RI MSDC-RI MSDC-RI
Column type CapillaryCapillaryCapillaryCapillaryCapillary
Active phase Supelcowax-10SP-1000PEG-20MDB-WaxSupelcowax-10
Column length (m) 0.85.50.60.60.
Carrier gas HeHeHeHeHe
Substrate
Column diameter (mm) 0.250.500.250.320.25
Phase thickness (μm)    0.500.25
Tstart (C) 40.65.70.50.40.
Tend (C) 240.225.250.250.200.
Heat rate (K/min) 3.3.2.8.3.
Initial hold (min)    1.3.
Final hold (min)    6.30.
I 1242.1244.1243.1253.1242.
ReferenceZygadlo, Ariza-Espinar, et al., 1997Brophy, Goldsack, et al., 1996Orav, Kailas, et al., 1996Sagrero-Nieves and Bartley, 1996Wong and Lai, 1996
Comment MSDC-RI MSDC-RI MSDC-RI MSDC-RI MSDC-RI
Column type CapillaryCapillaryCapillaryCapillaryCapillary
Active phase PEG-20MCarbowax 20MSupelcowax-10Supelcowax-10DB-Wax
Column length (m) 60.60.  60.
Carrier gas HeHe  He
Substrate
Column diameter (mm) 0.320.25  0.25
Phase thickness (μm) 0.250.25  0.25
Tstart (C) 70.50.40.40.50.
Tend (C) 180.150.210.210.230.
Heat rate (K/min) 2.2.2.2.2.
Initial hold (min) 7.10.2.2.4.
Final hold (min)  20.120.120.
I 1253.1248.1250.1250.1243.
ReferenceOrav, Kuningas, et al., 1995Tirado, Stashenko, et al., 1995Collin, Deslauriers, et al., 1993Collin, Deslauriers, et al., 1993Shimoda, Shiratsuchi, et al., 1993
Comment MSDC-RI MSDC-RI MSDC-RI MSDC-RI MSDC-RI
Column type CapillaryCapillaryCapillaryCapillaryCapillary
Active phase Carbowax 20MCarbowax 20MDB-WaxFFAPDB-Wax
Column length (m) 45.50.30.50.60.
Carrier gas HydrogenHe  He
Substrate
Column diameter (mm) 0.320.250.32 0.322
Phase thickness (μm) 1.0   0.25
Tstart (C) 60.60.70.50.50.
Tend (C) 200.180.200.180.230.
Heat rate (K/min) 2.2.4.10.4.
Initial hold (min) 5.4.2.1.
Final hold (min)
I 1253.1242.1261.1257.1245.
ReferenceKollmannsberger, Nitz, et al., 1992Kawakami and Kobayashi, 1991Wyllie, Brophy, et al., 1990Brophy, Davies, et al., 1989Engel, Flath, et al., 1988
Comment MSDC-RI MSDC-RI MSDC-RI MSDC-RI MSDC-RI
Column type CapillaryCapillaryCapillaryCapillaryCapillary
Active phase Carbowax 20MBP-20Carbowax 20MCarbowax 20MCarbowax 20M
Column length (m) 50.25.50.100.100.
Carrier gas
Substrate
Column diameter (mm) 0.250.20.320.250.25
Phase thickness (μm)
Tstart (C) 80.70.70.70.70.
Tend (C) 200.180.180.170.170.
Heat rate (K/min) 2.3.2.1.1.
Initial hold (min)  5.
Final hold (min)
I 1257.1251.1246.1227.1228.
ReferenceShibamoto, 1987MacLeod and Snyder, 1985Engel and Tressl, 1983Shibamoto and Jennings, 1977Shibamoto and Jennings, 1977
Comment MSDC-RI MSDC-RI MSDC-RI MSDC-RI MSDC-RI

Kovats' RI, polar column, isothermal

Data compiled by: NIST Mass Spectrometry Data Center, William E. Wallace, director

Column type CapillaryCapillaryCapillaryCapillaryCapillary
Active phase PEG-20MCarbowax 20MCarbowax 20MCarbowax 20MCarbowax 20M
Column length (m) 75.   152.
Carrier gas
Substrate
Column diameter (mm) 0.25   0.8
Phase thickness (μm)  0.50.50.5
Temperature (C) 100.100.70.90.70.
I 1252.1265.1250.61260.21254.
ReferenceMorishita, Okano, et al., 1980Saeed, Redant, et al., 1979Saeed, Redant, et al., 1979Saeed, Redant, et al., 1979Kepner, Ellison, et al., 1974
Comment MSDC-RI MSDC-RI MSDC-RI MSDC-RI MSDC-RI
Column type CapillaryCapillaryPacked
Active phase Carbowax 20MCarbowax 20M + Igepal (20:1)Carbowax 4000
Column length (m) 150.152.6.1
Carrier gas  HeN2
Substrate  GAS PAK FGas Chrom P (60-80 mesh)
Column diameter (mm) 0.750.8
Phase thickness (μm)
Temperature (C) 70.75.130.
I 1253.1247.1289.
ReferenceMalingré and Maarse, 1974Sakai, Maarse, et al., 1967Minyard, Tumlinson, et al., 1965
Comment MSDC-RI MSDC-RI MSDC-RI

References

Weast and Grasselli, 1989
CRC Handbook of Data on Organic Compounds, 2nd Editon, Weast,R.C and Grasselli, J.G., ed(s)., CRC Press, Inc., Boca Raton, FL, 1989, 1. [all data]
Lecat, 1943
Lecat, M.,
Azeotropes of Ethyl Urethane and other Azeotropes,
C. R. Hebd. Seances Acad. Sci., 1943, 217, 273. [all data]
Hoskovec, Grygarová, et al., 2005
Hoskovec, Michal; Grygarová, Dana; Cvacka, Josef; Streinz, Ludvík; Zima, Jirí; Verevkin, Sergey P.; Koutek, Bohumír,
Determining the vapour pressures of plant volatiles from gas chromatographic retention data,
Journal of Chromatography A, 2005, 1083, 1-2, 161-172, https://doi.org/10.1016/j.chroma.2005.06.006
. [all data]