α-Phellandrene
- Formula: C10H16
- Molecular weight: 136.2340
- IUPAC Standard InChIKey: OGLDWXZKYODSOB-UHFFFAOYSA-N
- CAS Registry Number: 99-83-2
- Chemical structure:
View 3d structure (requires JavaScript / HTML 5) - Stereoisomers:
- Other names: 1,3-Cyclohexadiene, 2-methyl-5-(1-methylethyl)-; α-Fellandrene; p-Mentha-1,5-diene; 5-Isopropyl-2-methyl-1,3-cyclohexadiene; 2-methyl-5-(1-methylethyl)-1,3-cyclohexadiene; 4-Isopropyl-1-methyl-1,5-cyclohexadiene; 2-Methyl-5-isopropyl-1,3-cyclohexadiene; alpha-Phellandrene; 5-Isopropyl-2-methyl-cyclohexa-1,3-diene; Menthadiene; Phellandrene; L-Phellandrene; 5-isopropyl-2-methylcyclohexa-1,3-diene (α-phellandrene); (-)-α-phellandrene; α-phellanderene

Phase change data

Data compiled as indicated in comments:
AC - William E. Acree, Jr., James S. Chickos
Enthalpy of vaporization
ΔvapH (kJ/mol) | Temperature (K) | Method | Reference | Comment |
---|---|---|---|---|
47.7 | 308. | A | Stephenson and Malanowski, 1987 | Based on data from 293. to 448. K.; AC |
Antoine Equation Parameters
log10(P) = A − (B / (T + C))
P = vapor pressure (bar)
T = temperature (K)
View plot Requires a JavaScript / HTML 5 canvas capable browser.
Temperature (K) | A | B | C | Reference | Comment |
---|---|---|---|---|---|
293. to 448. | 4.68169 | 1903.599 | -41.163 | Stull, 1947 | Coefficents calculated by NIST from author's data. |

Reaction thermochemistry data

Data compiled by: Hussein Y. Afeefy, Joel F. Liebman, and Stephen E. Stein
Individual Reactions
By formula: 2H2 + C10H16 = C10H20
Quantity | Value | Units | Method | Reference | Comment |
---|---|---|---|---|---|
ΔrH° | -52.92 ± 0.30 | kcal/mol | Chyd | Dolliver, Gresham, et al., 1937 | gas phase; Reanalyzed by Cox and Pilcher, 1970, Original value = -53.4 ± 0.3 kcal/mol; At 355 °K |

Normal alkane RI, polar column, temperature ramp

Data compiled by: NIST Mass Spectrometry Data Center, William E. Wallace, director

Column type CapillaryCapillaryCapillaryCapillaryCapillary
Active phase RTX-WaxDB-WaxBP-20DB-WaxSupelcowax
Column length (m) 60.30. 30.60.
Carrier gas Helium NitrogenHeliumNitrogen
Substrate
Column diameter (mm) 0.220.25 0.250.35
Phase thickness (μm) 0.250.25 0.250.25
Tstart (C) 60.40.60.80.60.
Tend (C) 230.240.200.240.230.
Heat rate (K/min) 2.5.5.3.4.
Initial hold (min)
Final hold (min) 5.5. 2.40.
I 1140.1210.1160.1168.1166.
ReferenceBendiabdellah, El Amine Dib, et al., 2012Niponsak, Laohakunjit, et al., 2011Mishra, Chaudhary, et al., 2010Vahirua-Lechat, Mitermite, et al., 2010Gauvin-Bialecki and Marodon, 2009
Comment MSDC-RI MSDC-RI MSDC-RI MSDC-RI MSDC-RI
Column type CapillaryCapillaryCapillaryCapillaryCapillary
Active phase RTX-WaxInnowaxHP-InnowaxHP-InnowaxCP-Wax 52CB
Column length (m) 60.30.30.30.60.
Carrier gas HeliumHeliumNitrogenN2He
Substrate
Column diameter (mm) 0.220.250.250.250.25
Phase thickness (μm) 0.250.250.520.250.25
Tstart (C) 60.40.35.50.40.
Tend (C) 230.250.205.240.220.
Heat rate (K/min) 2.6.3.5.3.
Initial hold (min)  1.10.1.
Final hold (min) 30.4.10.4.
I 1142.1165.1176.1160.1177.
ReferenceMuseli, Pau, et al., 2009Seo, Kim, et al., 2009Wannes, Mhamdi, et al., 2009Cheraif, Ben Jannet, et al., 2007Chyau, Tsai, et al., 2007
Comment MSDC-RI MSDC-RI MSDC-RI MSDC-RI MSDC-RI
Column type CapillaryCapillaryCapillaryCapillaryCapillary
Active phase CP-Wax 52CBTC-FFAPTC-FFAPSupelcowax-10CP-Wax 52CB
Column length (m) 30.  30.60.
Carrier gas HeHeHeHeHe
Substrate
Column diameter (mm) 0.320.250.250.20.32
Phase thickness (μm) 0.250.250.250.20.5
Tstart (C) 40.60.60.70.40.
Tend (C) 220.220.220.220.220.
Heat rate (K/min) 3.3.3.3.4.
Initial hold (min) 1.   8.
Final hold (min) 2.30.30.15.20.
I 1162.1176.1176.1171.1170.
ReferenceHymete, Rohloff, et al., 2007Kurose, Okamura, et al., 2007Kurose, Okamura, et al., 2007Pinto, Salgueiro, et al., 2007Povolo, Contarini, et al., 2007
Comment MSDC-RI MSDC-RI MSDC-RI MSDC-RI MSDC-RI
Column type CapillaryCapillaryCapillaryCapillaryCapillary
Active phase Supelcowax-10Supelcowax-10InnowaxInnowaxAT-Wax
Column length (m) 30.30.30.30.60.
Carrier gas  HeN2N2He
Substrate
Column diameter (mm) 0.250.250.250.250.25
Phase thickness (μm) 0.250.250.250.250.25
Tstart (C) 40.40.50.50.60.
Tend (C) 250.250.280.280.200.
Heat rate (K/min) 2.3.9.9.4.
Initial hold (min)  5.3.3.
Final hold (min) 33.10.3.3.20.
I 1170.1159.1160.1168.1180.
ReferenceSylvestre, Pichette, et al., 2007Vichi, Riu-Aumatell, et al., 2007Abdelwahed, Hayder, et al., 2006Abdelwahed, Hayder, et al., 2006Borges, Rojas, et al., 2006
Comment MSDC-RI MSDC-RI MSDC-RI MSDC-RI MSDC-RI
Column type CapillaryCapillaryCapillaryCapillaryCapillary
Active phase Supelcowax 10CP-Wax 52CBDB-WaxSupelcowaxHP-Wax
Column length (m) 30.30.60.30.30.
Carrier gas HeliumHe N2Nitrogen
Substrate
Column diameter (mm) 0.200.320.250.320.25
Phase thickness (μm) 0.200.250.250.250.25
Tstart (C) 70.60.70.50.50.
Tend (C) 220.220.230.200.280.
Heat rate (K/min) 3.3.32.5.5.
Initial hold (min)  7.2.
Final hold (min) 15.3.20. 5.
I 1171.1166.1172.1177.1160.
ReferenceCavaleiro, Pinto, et al., 2006Hymete, Rohloff, et al., 2006Lan Phi N.T., Nishiyama C., et al., 2006Martin, Joseph, et al., 2006Marzouk, Mansour, et al., 2006
Comment MSDC-RI MSDC-RI MSDC-RI MSDC-RI MSDC-RI
Column type CapillaryCapillaryCapillaryCapillaryCapillary
Active phase HP-20MNB-20MDB-WaxSupelcowax-10Supelcowax-10
Column length (m) 30.30.60.30.30.
Carrier gas N2He HeHe
Substrate
Column diameter (mm) 0.250.20.250.250.25
Phase thickness (μm) 0.250.250.250.250.25
Tstart (C) 50.50.70.50.50.
Tend (C) 250.250.230.220.250.
Heat rate (K/min) 5.2.2.4.4.
Initial hold (min)   2.1.1.
Final hold (min) 10. 20.10.10.
I 1160.1164.1173.1148.1148.
ReferenceMarzouk, Neffati, et al., 2006Orav, Raal, et al., 2006Sawamura, Onishi, et al., 2006Wong, Lim, et al., 2006Wong, Sivasothy, et al., 2006
Comment MSDC-RI MSDC-RI MSDC-RI MSDC-RI MSDC-RI
Column type CapillaryCapillaryCapillaryCapillaryCapillary
Active phase Carbowax 20MDB-WaxCarbowax 20MSupelcowaxStabilwax
Column length (m) 60.30.50.60.30.
Carrier gas N2N2 HeH2
Substrate
Column diameter (mm) 0.250.250.20.20.32
Phase thickness (μm) 0.250.250.250.20.5
Tstart (C) 40.60.60.60.40.
Tend (C) 190.250.250.230.280.
Heat rate (K/min) 10.5.2.4.6.
Initial hold (min) 2. 60.30.5.
Final hold (min) 15.10.  5.
I 1178.1151.1193.1148.1168.
ReferenceBabu and Kaul, 2005Fakhari A.R., Sonboli A., et al., 2005Fernandez, Lizzani-Cuvelier, et al., 2005Gauvin and Smadja, 2005Jirovetz, Buchbauer, et al., 2005
Comment MSDC-RI MSDC-RI MSDC-RI MSDC-RI MSDC-RI
Column type CapillaryCapillaryCapillaryCapillaryCapillary
Active phase DB-WaxDB-WaxDB-WaxCP-Wax 52CBSupelcowax-10
Column length (m) 60.60.60.30.30.
Carrier gas N2N2NitrogenHe
Substrate
Column diameter (mm) 0.250.250.320.320.25
Phase thickness (μm) 0.250.250.500.250.25
Tstart (C) 70.70.35.40.40.
Tend (C) 230.230.235.220.210.
Heat rate (K/min) 2.2.2.4.2.
Initial hold (min) 2.2.4.1.2.
Final hold (min) 20.20.30. 33.
I 1179.1179.1192.1168.1154.
ReferenceNjoroge, Koaze, et al., 2005Njoroge, Koaze, et al., 2005, 2Qian and Wang, 2005Rohloff and Bones, 2005Stevanovic, Garneau, et al., 2005
Comment MSDC-RI MSDC-RI MSDC-RI MSDC-RI MSDC-RI
Column type CapillaryCapillaryCapillaryCapillaryCapillary
Active phase Supelcowax-10DB-WaxBP-20DB-WaxDB-Wax
Column length (m) 30.30.50.60.60.
Carrier gas HeHe N2N2
Substrate
Column diameter (mm) 0.250.250.220.250.25
Phase thickness (μm) 0.250.250.250.250.25
Tstart (C) 50.90.60.70.70.
Tend (C) 220.220.220.230.230.
Heat rate (K/min) 4.7.2.2.2.
Initial hold (min) 3.2. 2.2.
Final hold (min) 30.5.20.20.20.
I 1173.1195.1160.1176.1177.
ReferenceWong, Lee, et al., 2005Agnihotri, Thappa, et al., 2004Blanc, Muselli, et al., 2004Choi, 2004Choi, 2004, 2
Comment MSDC-RI MSDC-RI MSDC-RI MSDC-RI MSDC-RI
Column type CapillaryCapillaryCapillaryCapillaryCapillary
Active phase Supelcowax-10DB-WaxSupelcowax-10Supelcowax-10Supelcowax-10
Column length (m) 30.60.30.50.50.
Carrier gas N2He HeHe
Substrate
Column diameter (mm) 0.250.250.250.20.2
Phase thickness (μm) 0.25 0.250.250.25
Tstart (C) 40.60.40.70.70.
Tend (C) 230.220.210.230.230.
Heat rate (K/min) 2.2.2.2.2.
Initial hold (min)  4.2.
Final hold (min)   33.
I 1167.1167.1186.1165.1165.
ReferenceGonzález, Guerra, et al., 2004Jiang and Kubota, 2004Lopez Arze, Collin, et al., 2004Orav, Stulova, et al., 2004Orav, Stulova, et al., 2004
Comment MSDC-RI MSDC-RI MSDC-RI MSDC-RI MSDC-RI
Column type CapillaryCapillaryCapillaryCapillaryCapillary
Active phase InnowaxDB-WaxDB-WaxHP-20MTC-Wax
Column length (m) 50.60.60.50.60.
Carrier gas He NitrogenHeHe
Substrate
Column diameter (mm) 0.20.250.250.20.25
Phase thickness (μm) 0.20.250.250.2
Tstart (C) 70.70.70.70.80.
Tend (C) 220.230.230.180.240.
Heat rate (K/min) 4.2.2.4.3.
Initial hold (min)  2.2.4.
Final hold (min)  20. 10.
I 1186.1183.1183.1156.1178.
ReferencePalá-Paúl, García-Jiménez, et al., 2004Sawamura, Son, et al., 2004Sawamura, Sou, et al., 2004Juteau, Jerkovic, et al., 2003Miyazawa, Teranishi, et al., 2003
Comment MSDC-RI MSDC-RI MSDC-RI MSDC-RI MSDC-RI
Column type CapillaryCapillaryCapillaryCapillaryCapillary
Active phase DB-WaxSupelcowax-10Carbowax 20MHP-InnowaxDB-Wax
Column length (m) 60.50.50.50.60.
Carrier gas HeliumHeN2 N2
Substrate
Column diameter (mm) 0.250.20.250.20.25
Phase thickness (μm)  0.250.250.20.25
Tstart (C) 70.70.90.50.70.
Tend (C) 210.230.220.220.230.
Heat rate (K/min) 2.2.3.4.2.
Initial hold (min)    5.2.
Final hold (min) 60.   20.
I 1176.1167.1168.1180.1160.
ReferenceMookdasanit, Tamura, et al., 2003Orav, Kailas, et al., 2003Priestap, van Baren, et al., 2003Stashenko, Jaramillo, et al., 2003Tu, Onishi, et al., 2003
Comment MSDC-RI MSDC-RI MSDC-RI MSDC-RI MSDC-RI
Column type CapillaryCapillaryCapillaryCapillaryCapillary
Active phase DB-WaxHP-InnowaxCarbowax 20MDB-WaxCarbowax 20M
Column length (m) 60.50.25.60.30.
Carrier gas N2HeN2H2He
Substrate
Column diameter (mm) 0.250.20.250.320.25
Phase thickness (μm) 0.250.20.250.250.325
Tstart (C) 70.70.50.40.50.
Tend (C) 230.190.250.245.215.
Heat rate (K/min) 2.5.4.1.54.
Initial hold (min) 2.
Final hold (min) 20. 10.20.20.
I 1172.1180.1168.1153.1177.
ReferenceTu, Onishi, et al., 2003, 2Velasco-Negueruela, Pérez-Alonso, et al., 2003Zrira, Elamrani, et al., 2003Gancel, Ollé, et al., 2002Kasali, Winterhalter, et al., 2002
Comment MSDC-RI MSDC-RI MSDC-RI MSDC-RI MSDC-RI
Column type CapillaryCapillaryCapillaryCapillaryCapillary
Active phase Supelcowax-10DB-WaxDB-WaxDB-WaxTC-Wax
Column length (m) 60.60.60.60.60.
Carrier gas HeN2N2HeHe
Substrate
Column diameter (mm) 0.20.250.250.250.25
Phase thickness (μm) 0.50.250.250.25
Tstart (C) 70.70.70.45.80.
Tend (C) 220.230.230.240.250.
Heat rate (K/min) 2.2.2.3.4.
Initial hold (min)  2.
Final hold (min)  20.  47.
I 1167.1169.1179.1164.1173.
ReferenceOrav, Kailas, et al., 2002Tu, Onishi, et al., 2002Tu, Thanh, et al., 2002Christoph, 2001Miyazawa, Kurose, et al., 2001
Comment MSDC-RI MSDC-RI MSDC-RI MSDC-RI MSDC-RI
Column type CapillaryCapillaryCapillaryCapillaryCapillary
Active phase CP-Wax 52CBDB-WaxDB-WaxBP-20DB-Wax
Column length (m) 50.30.30.25.60.
Carrier gas HeHeHeNitrogenNitrogen
Substrate
Column diameter (mm) 0.300.20.20.500.25
Phase thickness (μm) 0.25  0.25
Tstart (C) 40.50.50.60.40.
Tend (C) 220.180.180.200.200.
Heat rate (K/min) 3.3.3.5.2.
Initial hold (min) 5.8.8. 10.
Final hold (min)
I 1160.1160.1169.1166.1180.
ReferenceChagonda, Makanda, et al., 2000Franco and Shibamoto, 2000Franco and Shibamoto, 2000Mallavarapu, Rao, et al., 2000Tamura, Boonbumrung, et al., 2000
Comment MSDC-RI MSDC-RI MSDC-RI MSDC-RI MSDC-RI
Column type CapillaryCapillaryCapillaryCapillaryCapillary
Active phase DB-WaxInnowaxDB-WaxNB-351BP-20
Column length (m) 60.60.60.25.25.
Carrier gas HeHeHeH2N2
Substrate
Column diameter (mm) 0.250.250.250.30.5
Phase thickness (μm) 0.250.250.250.5
Tstart (C) 40.60.60.70.60.
Tend (C) 200.220.240.250.200.
Heat rate (K/min) 2. 4.5.5.
Initial hold (min) 2.10. 2.
Final hold (min)
I 1161.1176.1167.1194.1168.
ReferenceUmano, Hagi, et al., 2000Kaya, Baser, et al., 1999Ngassoum, Yonkeu, et al., 1999Onocha, Ekundayo, et al., 1999Rao, Bhattacharya, et al., 1999
Comment MSDC-RI MSDC-RI MSDC-RI MSDC-RI MSDC-RI
Column type CapillaryCapillaryCapillaryCapillaryCapillary
Active phase BP-20DB-WaxHP-InnowaxDB-WaxBP-20
Column length (m) 25.30.60.60.25.
Carrier gas H2N2HeH2H2
Substrate
Column diameter (mm) 0.330.250.250.320.33
Phase thickness (μm) 0.50.250.250.250.5
Tstart (C) 80.45.50.60.80.
Tend (C) 220.220.220.220.220.
Heat rate (K/min) 5.3.5.3.5.
Initial hold (min)   5.
Final hold (min)
I 1186.1169.1177.1171.1186.
ReferenceBignell, Dunlop, et al., 1998Mölleken, Sinnwell, et al., 1998Stashenko, Cervantes, et al., 1998Werkhoff, Güntert, et al., 1998Bignell, Dunlop, et al., 1997
Comment MSDC-RI MSDC-RI MSDC-RI MSDC-RI MSDC-RI
Column type CapillaryCapillaryCapillaryCapillaryCapillary
Active phase BP-20BP-20BP-20BP-20BP-20
Column length (m) 25.25.25.25.25.
Carrier gas H2H2H2 H2
Substrate
Column diameter (mm) 0.330.330.330.330.33
Phase thickness (μm) 0.50.50.50.50.5
Tstart (C) 80.80.80.80.80.
Tend (C) 220.220.220.220.220.
Heat rate (K/min) 5.5.5.5.5.
Initial hold (min)
Final hold (min)
I 1186.1186.1186.1186.1186.
ReferenceBignell, Dunlop, et al., 1997, 2Bignell, Dunlop, et al., 1997, 3Bignell, Dunlop, et al., 1997, 4Bignell, Dunlop, et al., 1997, 5Bignell, Dunlop, et al., 1997, 6
Comment MSDC-RI MSDC-RI MSDC-RI MSDC-RI MSDC-RI
Column type CapillaryCapillaryCapillaryCapillaryCapillary
Active phase Supelcowax-10SP-1000PEG-20MDB-WaxSupelcowax-10
Column length (m) 30.85.50.60.60.
Carrier gas  HeHeHeHe
Substrate
Column diameter (mm) 0.250.500.250.250.25
Phase thickness (μm)    0.250.25
Tstart (C) 60.65.70.50.40.
Tend (C) 240.225.250.180.200.
Heat rate (K/min) 4.3.2.2.53.
Initial hold (min)    5.3.
Final hold (min)     30.
I 1167.1156.1164.1169.1167.
ReferenceZunino, Novillo-Newton, et al., 1997Brophy, Goldsack, et al., 1996Orav, Kailas, et al., 1996Stashenko, Puertas, et al., 1996Wong and Lai, 1996
Comment MSDC-RI MSDC-RI MSDC-RI MSDC-RI MSDC-RI
Column type CapillaryCapillaryCapillaryCapillaryCapillary
Active phase PEG-20MCarbowax 20MCarbowax 20MDB-WaxDB-Wax
Column length (m) 60.60.45.60.30.
Carrier gas HeHeHydrogen
Substrate
Column diameter (mm) 0.320.250.320.320.32
Phase thickness (μm) 0.250.251.0
Tstart (C) 70.50.60.50.70.
Tend (C) 180.150.200.230.200.
Heat rate (K/min) 2.2.2.4.4.
Initial hold (min) 7.10.5. 2.
Final hold (min)  20. 10.
I 1172.1177.1174.1160.1176.
ReferenceOrav, Kuningas, et al., 1995Tirado, Stashenko, et al., 1995Kollmannsberger, Nitz, et al., 1992Binder, Benson, et al., 1990Wyllie, Brophy, et al., 1990
Comment MSDC-RI MSDC-RI MSDC-RI MSDC-RI MSDC-RI
Column type CapillaryCapillaryCapillaryCapillaryCapillary
Active phase FFAPDB-WaxCarbowax 20MBP-20Carbowax 20M
Column length (m) 50.60.150.25.100.
Carrier gas  He
Substrate
Column diameter (mm)  0.3220.660.20.25
Phase thickness (μm)  0.25
Tstart (C) 50.50.60.70.70.
Tend (C) 180.230.170.180.170.
Heat rate (K/min) 10.4.1.3.1.
Initial hold (min) 1. 40.5.
Final hold (min)
I 1172.1162.1150.1177.1177.
ReferenceBrophy, Davies, et al., 1989Engel, Flath, et al., 1988Buttery, Ling, et al., 1987MacLeod and Snyder, 1985Shibamoto and Jennings, 1977
Comment MSDC-RI MSDC-RI MSDC-RI MSDC-RI MSDC-RI
Column type CapillaryPacked
Active phase Carbowax 20MCarbowax 20M
Column length (m) 100.2.
Carrier gas  Hydrogen
Substrate  Gas-Chrom Z (80-100 mesh)
Column diameter (mm) 0.25
Phase thickness (μm)
Tstart (C) 70.65.
Tend (C) 170.220.
Heat rate (K/min) 1.4.
Initial hold (min)
Final hold (min)
I 1179.1186.
ReferenceShibamoto and Jennings, 1977Stancher and Pertoldi, 1967
Comment MSDC-RI MSDC-RI

Normal alkane RI, polar column, custom temperature program

Data compiled by: NIST Mass Spectrometry Data Center, William E. Wallace, director

Column type CapillaryCapillaryCapillaryCapillaryCapillary
Active phase PEG-20M InnowaxDB-WaxDB-WaxInnowax FSCInnowax FSC
Column length (m) 30.60.60.60.60.
Carrier gas NitrogenHeliumHeliumHeliumHelium
Substrate
Column diameter (mm) 0.250.200.250.250.25
Phase thickness (μm) 0.250.250.500.250.25
Program 50 0C (7 min) 20 0C/min -> 130 0C (1 min) 1 0C/min -> 150 0C 8 0C/min -> 190 0C (5 min)40 0C (3 min) 2 0C/min -> 150 0C 4 0C/min -> 220 0C (20 min) 5 0C/min -> 230 0C40 0C 4 0C/min -> 230 0C 100 0C/min -> 260 0C (11.7 min)60 0C (10 min) 4 0C/min -> 220 0C (10 min) 1 0C/min -> 240 0C60 0C (10 min) 4 0C/min -> 220 0C (10 min) 1 0C/min -> 240 0C
I 1172.1161.1195.1176.1176.
ReferenceWang, Tian, et al., 2013Gyawali and Kim, 2012Miyazaki, Plotto, et al., 2011Polatoglu, Demirci, et al., 2010Baser, Demirci, et al., 2009
Comment MSDC-RI MSDC-RI MSDC-RI MSDC-RI MSDC-RI
Column type CapillaryCapillaryCapillaryCapillaryCapillary
Active phase HP Innowax FSPInnowaxCP-Wax 52 CBCarbowax 20MHP Innowax FSP
Column length (m) 60.30.50.30.60.
Carrier gas HeliumHeliumHeliumHeN2
Substrate
Column diameter (mm) 0.250.250.250.250.25
Phase thickness (μm) 0.250.250.290.250.25
Program 60 0C (10 min) 4 0C/min -> 220 0C (10 min) 1 0C/min -> 240 0C (20 min)not specified33 0C (1 min) 2 0C/min -> 130 0C 10 0C/min -> 220 0Cnot specified60C(10min) => 4C/min => 220C(10min) => 1C/min => 240C
I 1176.1168.1140.1177.1176.
ReferenceWedge, Klun, et al., 2009Aicha, Ines, et al., 2008Kaack and Christensen, 2008Hudaib and Aburjai, 2007Tabanca N., Demirci B., et al., 2007
Comment MSDC-RI MSDC-RI MSDC-RI MSDC-RI MSDC-RI
Column type CapillaryCapillaryCapillaryCapillaryCapillary
Active phase Innowax FSCHP-Innowax FSCCarbowax 20MHP-Innowax FSCInnowax FSC
Column length (m) 60.60.25.60.60.
Carrier gas HeHeH2HeHe
Substrate
Column diameter (mm) 0.250.250.320.250.25
Phase thickness (μm) 0.250.250.250.250.25
Program 60C(10min) => 4C/min => 220C (10min) => 1C/min => 240C60C(10min) => 4C/min => 220C (10min) => 1C/min => 240C40C(8min) => 3C/min => 180C => 20C/min => 230C (10min)60(10min) => 4C/min => 220C(10min) => 1C/min => 240C60C(10min) => 4C/min => 220C(10min) => 1C/min => 240C
I 1176.1176.1161.1176.1176.
ReferenceBaser K.H.C., Ozek G., et al., 2006Erdurak, Coskun, et al., 2006Lorenzo, Loayza, et al., 2006Suleimenov Y.M., Atazhanova G.A., et al., 2006Kosar, Özek, et al., 2005
Comment MSDC-RI MSDC-RI MSDC-RI MSDC-RI MSDC-RI
Column type CapillaryCapillaryCapillaryCapillaryCapillary
Active phase DB-WaxDB-WaxHP-Innowax FSCHP-Innowax FSCHP-Innowax FSC
Column length (m)   60.60.60.
Carrier gas N2N2HeHeHe
Substrate
Column diameter (mm)   0.250.250.25
Phase thickness (μm)   0.250.250.25
Program not specifiednot specified60C(10min) => 4C/min => 220C(10min) => 1C/min => 240C60C(10min) => 4C/min => 220C(10min) => 1C/min => 240C60C(10min) => 4C/min => 220C(10min) => 1C/min => 240C
I 1157.1201.1176.1176.1176.
ReferencePala-Paul, Perez-Alonso, et al., 2005Pala-Paul, Perez-Alonso, et al., 2005Viljoen, Subramoney, et al., 2005Kivcak, Akay, et al., 2004Kivcak, Akay, et al., 2004
Comment MSDC-RI MSDC-RI MSDC-RI MSDC-RI MSDC-RI
Column type CapillaryCapillaryCapillaryCapillaryCapillary
Active phase Carbowax 20MHP-Innowax FSCHP-Innowax FSCHP Innowax FSPInnowax FSC
Column length (m)  60.60.60.60.
Carrier gas  HeN2HeHe
Substrate
Column diameter (mm)  0.250.250.250.25
Phase thickness (μm)  0.250.250.250.25
Program not specified60C(10min) => 4C/min => 220C(10min) => 1C/min => 240C60C(10min) => 4C/min => 220C(10min) => 1C/min => 240C60C(10min) => 4C/min => 220C (10min) => 1C/min => 240C60C(10min) => 4C/min => 220C(10min) => 1C/min => 240C
I 1177.1176.1176.1176.1176.
ReferenceVinogradov, 2004Demirci, Demirci, et al., 2003Kaya, Demirci, et al., 2003Tasdemir, Demirci, et al., 2003Baser, Demirei, et al., 2002
Comment MSDC-RI MSDC-RI MSDC-RI MSDC-RI MSDC-RI
Column type CapillaryCapillaryCapillaryCapillaryCapillary
Active phase HP-InnowaxHP-InnowaxCarbowax 20MHP-Innowax FSCInnowax
Column length (m) 30.60. 60.60.
Carrier gas H2HeH2HeHe
Substrate
Column diameter (mm) 0.320.25 0.250.25
Phase thickness (μm) 0.50.25 0.250.25
Program 40C (8min) => 3C/min => 180C => 20C/min => 240C60 0C (10 min) 10 K/min -> 220 0C (10 min) 1K/min -> 240 0Cnot specified60C(10min) => 4C/min => 220C(10min) => 1C/min => 240C60C(10min) => 4C/min => 200C(10min) => 1C/min => 240C
I 1174.1176.1175.1176.1176.
ReferenceParoul, Rota, et al., 2002Baser, Demirci, et al., 2001Gallori, Bilia, et al., 2001Kirimer N., Tabanea N., et al., 2001Özcan, Akgül, et al., 2001
Comment MSDC-RI MSDC-RI MSDC-RI MSDC-RI MSDC-RI
Column type CapillaryCapillaryCapillaryCapillaryCapillary
Active phase Innowax FSCHP-Innowax FSCHP-WaxInnowaxInnowax FSC
Column length (m) 60.60.60.60.60.
Carrier gas He HeHeHe
Substrate
Column diameter (mm) 0.250.250.250.250.25
Phase thickness (μm) 0.250.250.250.250.25
Program 60C(10min) => 4C/min => 220C(10min) => 1C/min => 240C60C(10min) => 4C/min => 220C(10min) => 1C/min => 240C50 0C 3 K/min -> 200 0C 8 K/min -> 280 0C60 0C (10 min) 4 K/min -> 220 0C (10 min) 1 K/min -> 240 0C60C(10 min) => 4C/min => 220C(10min) => 1C/min => 240C
I 1176.1176.1170.1176.1176.
ReferenceSaglam, Gozler, et al., 2001Tabanca, Kirimer, et al., 2001Usubillaga, Aparicio, et al., 2001Baser, Özek, et al., 2000Kirimer, Tabanca, et al., 2000
Comment MSDC-RI MSDC-RI MSDC-RI MSDC-RI MSDC-RI
Column type CapillaryCapillaryCapillaryCapillaryCapillary
Active phase Innowax FSCCarbowax 20MNB-351Carbowax 20MCarbowax 20M
Column length (m) 60.60.25.
Carrier gas HeliumHeHeHe
Substrate
Column diameter (mm) 0.250.250.32
Phase thickness (μm) 0.250.250.2
Program 60 0C (10 min) 4 0C/min -> 220 0C (10 min) 1 0C/min -> 240 0Cnot specified35C(5min) => 2.5C/min => 150C => 5C/min => 240C (20min)not specifiednot specified
I 1176.1177.1166.1177.1177.
ReferenceKirimer, Tabanca, et al., 1999Tirado, Stashenko, et al., 1995Kerrola and Kallio, 1994Chanegriha and Baaliouamer, 1993Shibamoto, 1987
Comment MSDC-RI MSDC-RI MSDC-RI MSDC-RI MSDC-RI
Column type Capillary
Active phase Polyethylene Glycol
Column length (m)
Carrier gas
Substrate
Column diameter (mm)
Phase thickness (μm)
Program not specified
I 1177.
ReferenceMacLeod and Pieris, 1981
Comment MSDC-RI

Van Den Dool and Kratz RI, non-polar column, custom temperature program

Data compiled by: NIST Mass Spectrometry Data Center, William E. Wallace, director

Column type CapillaryCapillaryCapillaryCapillaryCapillary
Active phase BPX-5BPX-5SE-52SE-52HP-5MS
Column length (m) 30.30.30.30.30.
Carrier gas He HeHeHe
Substrate
Column diameter (mm) 0.250.250.320.320.25
Phase thickness (μm) 0.250.250.150.150.25
Program 35C => 4C/min => 200C => 30C/min => 300C (3min)35C(5min) => 3C/min => 210C => 40C/min => 240C (4min)45C => 1C/min => 100C => 5C/min => 250C (10min)45C => 1C/min => 100C => 5C/min => 250C(10min)50C (3min) => 3C/min => 200C => 6C/min => 240C
I 1006.1016.1004.1003.1003.
ReferenceDharmawan, Kasapis, et al., 2007Cardeal, da Silva, et al., 2006Guerrini, Sacchetti, et al., 2006Sacchetti, Guerrini, et al., 2006Akpulat, Tepe, et al., 2005
Comment MSDC-RI MSDC-RI MSDC-RI MSDC-RI MSDC-RI
Column type CapillaryCapillaryCapillaryCapillaryCapillary
Active phase SE-52HP-5CBP-55 % Phenyl methyl siloxaneDB-5MS
Column length (m) 30.30.30.30.30.
Carrier gas HeHeHeHeHe
Substrate  Chromosorb W
Column diameter (mm) 0.320.320.250.320.25
Phase thickness (μm) 0.150.250.250.150.25
Program 45C => 1C/min => 100C => 5C/min => 250C(10min)80 0C 8 K/min -> 150 0C 5 K/min -> 230 0C (10 min)60C => 3C/min => 240C => 10C/min => 280C(10min)45C => 1C/min => 100C => 5C/min => 250C (10min)40 (5min) => 4C/min => 140C => 4C/min => 200C (20min)
I 1003.1004.1002.1003.1004.
ReferenceBruni, Pellati, et al., 2005Gopanraj, Dan, et al., 2005Oliveira, Campos, et al., 2005Sacchetti, Maietti, et al., 2005Zheng, Kim, et al., 2005
Comment MSDC-RI MSDC-RI MSDC-RI MSDC-RI MSDC-RI
Column type CapillaryCapillaryCapillaryCapillaryCapillary
Active phase DB-5DB-5MSDB-5SE-52SE-52
Column length (m) 30.30.30.25.25.
Carrier gas HeHeHeHeH2
Substrate
Column diameter (mm) 0.320.250.320.250.32
Phase thickness (μm) 1.0.251.0.250.40
Program 40C (2min) => 5C/min => 100C => 4C/min => 230C (10min)40C(5min) => 4C/min => 160C => 8C/min => 240C (15min)40C(2min) => 2C/min => 100C => 10C/min => 230C (5min)60C(8min) => 3C/min => 180C => 20C/min => 230C60 C (8 min) 3 C/min -> 180 C 20 C/min -> 250 C (10 min)
I 1011.1000.1000.1002.1000.
ReferenceKlesk, Qian, et al., 2004Kim, Lee, et al., 2003Klesk and Qian, 2003Lorenzo, Loayza, et al., 2003Lorenzo, Loayza, et al., 2002
Comment MSDC-RI MSDC-RI MSDC-RI MSDC-RI MSDC-RI
Column type CapillaryCapillaryCapillaryCapillaryCapillary
Active phase SE-52BP-1SE-54RTX-5SE-52
Column length (m) 25. 30.30.25.
Carrier gas He HeHeHe
Substrate
Column diameter (mm) 0.25 0.320.320.25
Phase thickness (μm) 0.25 0.250.250.25
Program 60 0C (8 min) 3 K/min -> 180 0C 20 K/min -> 230 0Cnot specified35C(2min) => 40C/min => 65C => 6C/min => 250C35C(2min) => 40C/min => 65C => 6C/min => 250C60 0C (8 min) 3 K/min -> 180 0C 20 K/min -> 230 0C
I 1000.998.995.1009.1003.
ReferenceLorenzo, Saavedra, et al., 2001Filippini, Tomi, et al., 2000Jagella and Grosch, 1999Jagella and Grosch, 1999Loayza, de Groot, et al., 1999
Comment MSDC-RI MSDC-RI MSDC-RI MSDC-RI MSDC-RI
Column type CapillaryCapillaryCapillaryCapillary
Active phase SE-54SE-54BPX-5SE-52
Column length (m) 30.30.50.60.
Carrier gas HeHeHeHe
Substrate
Column diameter (mm) 0.320.320.320.32
Phase thickness (μm) 0.250.250.50.40
Program 35C (2min) => 40C/min => 60C (2min) => 6C/min => 180C => 10C/min => 230C (5min)35 0C 40 0C/min -> 60 0C (2 min) 6 0C/min -> 180 0C 10 0C/min -> 230 0C0C (5min) => 40C/min => 40C (2min) => 10C/min => 280C45 C (6 min) 3 C/min -> 111 0C 2 C/min -> 160 C 3 C/min -> 300 C (15 min)
I 1005.1005.1024.1003.
ReferenceTairu, Hofmann, et al., 1999Tairu, Hofmann, et al., 1999, 2Elmore, Erbahadir, et al., 1997Mondello, Dugo, et al., 1995
Comment MSDC-RI MSDC-RI MSDC-RI MSDC-RI

Kovats' RI, non-polar column, isothermal

Data compiled by: NIST Mass Spectrometry Data Center, William E. Wallace, director

Column type CapillaryCapillaryCapillaryCapillaryCapillary
Active phase ZB-1ZB-1ZB-1ZB-1ZB-1
Column length (m) 30.30.30.30.30.
Carrier gas HeHeHeHeHe
Substrate
Column diameter (mm) 0.320.320.320.320.32
Phase thickness (μm) 0.250.250.250.250.25
Temperature (C) 100.110.120.130.140.
I 1003.671006.671009.741012.781015.83
ReferenceHoskovec, Grygarová, et al., 2005Hoskovec, Grygarová, et al., 2005Hoskovec, Grygarová, et al., 2005Hoskovec, Grygarová, et al., 2005Hoskovec, Grygarová, et al., 2005
Comment MSDC-RI MSDC-RI MSDC-RI MSDC-RI MSDC-RI
Column type CapillaryCapillaryCapillaryCapillaryCapillary
Active phase ZB-1ZB-1ZB-1ZB-1ZB-1
Column length (m) 30.30.30.30.30.
Carrier gas HeHeHeHeHe
Substrate
Column diameter (mm) 0.320.320.320.320.32
Phase thickness (μm) 0.250.250.250.250.25
Temperature (C) 150.40.50.60.70.
I 1019.04986.95989.59992.3995.05
ReferenceHoskovec, Grygarová, et al., 2005Hoskovec, Grygarová, et al., 2005Hoskovec, Grygarová, et al., 2005Hoskovec, Grygarová, et al., 2005Hoskovec, Grygarová, et al., 2005
Comment MSDC-RI MSDC-RI MSDC-RI MSDC-RI MSDC-RI
Column type CapillaryCapillaryCapillaryCapillaryCapillary
Active phase ZB-1ZB-1DB-1SE-30Apiezon L
Column length (m) 30.30.28.40.45.
Carrier gas HeHeHe
Substrate
Column diameter (mm) 0.320.320.250.350.25
Phase thickness (μm) 0.250.250.250.35
Temperature (C) 80.90.150.100.100.
I 997.861000.1003.1001.41024.
ReferenceHoskovec, Grygarová, et al., 2005Hoskovec, Grygarová, et al., 2005Viswanathan, Maridass, et al., 2002Tudor, 1997Morishita, Okano, et al., 1980
Comment MSDC-RI MSDC-RI MSDC-RI MSDC-RI MSDC-RI
Column type CapillaryCapillaryCapillaryPackedPacked
Active phase SE-30SE-30SE-30SqualaneApiezon L
Column length (m) 80.80.80.15.6.1
Carrier gas    HeN2
Substrate    Chromosorb PGas Chrom P (60-80 mesh)
Column diameter (mm) 0.50.50.50.25
Phase thickness (μm) 0.80.80.8
Temperature (C) 100.110.130.86.130.
I 1003.71007.11012.1006.1034.
ReferenceSaeed, Redant, et al., 1979Saeed, Redant, et al., 1979Saeed, Redant, et al., 1979Hively and Hinton, 1968Minyard, Tumlinson, et al., 1965
Comment MSDC-RI MSDC-RI MSDC-RI MSDC-RI MSDC-RI

References

Stephenson and Malanowski, 1987
Stephenson, Richard M.; Malanowski, Stanislaw,
Handbook of the Thermodynamics of Organic Compounds, 1987, https://doi.org/10.1007/978-94-009-3173-2
. [all data]
Stull, 1947
Stull, Daniel R.,
Vapor Pressure of Pure Substances. Organic and Inorganic Compounds,
Ind. Eng. Chem., 1947, 39, 4, 517-540, https://doi.org/10.1021/ie50448a022
. [all data]