Methylparaben
- Formula: C8H8O3
- Molecular weight: 152.1473
- IUPAC Standard InChIKey: LXCFILQKKLGQFO-UHFFFAOYSA-N
- CAS Registry Number: 99-76-3
- Chemical structure:
View 3d structure (requires JavaScript / HTML 5) - Other names: Benzoic acid, 4-hydroxy-, methyl ester; Benzoic acid, p-hydroxy-, methyl ester; p-Carbomethoxyphenol; p-Hydroxybenzoic acid, methyl ester; p-Methoxycarbonylphenol; Abiol; Maseptol; Methaben; Methyl chemosept; Methyl p-hydroxybenzoate; Methyl Butex; Methyl Parasept; Methyl 4-hydroxybenzoate; Methylben; Metoxyde; Moldex; Nipagin; Nipagin M; Paridol; Preserval; Preserval M; Septos; Solbrol; Solbrol M; Tegosept M; 4-(Methoxycarbonyl)phenol; 4-Hydroxybenzoic acid, methyl ester; Aseptoform; Metaben; Methyl ester of p-hydroxybenzoic acid; Methylester kyseliny p-hydroxybenzoove; Methyl parahydroxybenzoate; p-Oxybenzoesauremethylester; Lexgard M; NSC 3827; Paraben M; Metagin; p-Hydroxybenzoic methyl ester; component of Heb-Cort MC; Paraben; Parasept; Methyl p-oxybenzoate; Methyl //p//-Hydroxybenzoate; Methylparaben USP; Nigagin; Solparol; Preserval MS; Solparol (Salt/Mix); Preserval MS (Salt/Mix)

Phase change data

Data compiled as indicated in comments:
TRC - Thermodynamics Research Center, NIST Boulder Laboratories, Chris Muzny director
AC - William E. Acree, Jr., James S. Chickos
Quantity | Value | Units | Method | Reference | Comment |
---|---|---|---|---|---|
Tfus | 398.4 | K | N/A | Manzo and Ahumanda, 1990 | Uncertainty assigned by TRC = 0.5 K; TRC |
Quantity | Value | Units | Method | Reference | Comment |
ΔvapH° | 19.9 | kcal/mol | CGC | Temprado, Roux, et al., 2005 | AC |
Quantity | Value | Units | Method | Reference | Comment |
ΔsubH° | 23.6 ± 0.2 | kcal/mol | GS | Perlovich, Rodionov, et al., 2005 | Based on data from 303. to 327. K.; AC |
Enthalpy of vaporization
ΔvapH (kcal/mol) | Temperature (K) | Method | Reference | Comment |
---|---|---|---|---|
19.5 | 461. | A | Stephenson and Malanowski, 1987 | Based on data from 446. to 517. K.; AC |
Enthalpy of fusion
ΔfusH (kcal/mol) | Temperature (K) | Reference | Comment |
---|---|---|---|
6.05 | 399.2 | Giordano, Bettini, et al., 1999 | AC |
5.810 | 398.5 | Manzo and Ahumada, 1990 | AC |

Gas phase ion energetics data

Data evaluated as indicated in comments:
HL - Edward P. Hunter and Sharon G. Lias
Data compiled as indicated in comments:
B - John E. Bartmess
Quantity | Value | Units | Method | Reference | Comment |
---|---|---|---|---|---|
Proton affinity (review) | 206.4 | kcal/mol | N/A | Hunter and Lias, 1998 | HL |
Quantity | Value | Units | Method | Reference | Comment |
Gas basicity | 199.0 | kcal/mol | N/A | Hunter and Lias, 1998 | HL |
De-protonation reactions
C8H7O3- + =
By formula: C8H7O3- + H+ = C8H8O3
Quantity | Value | Units | Method | Reference | Comment |
---|---|---|---|---|---|
ΔrH° | 337.1 ± 2.1 | kcal/mol | G+TS | Fujio, McIver, et al., 1981 | gas phase; value altered from reference due to change in acidity scale; B |
Quantity | Value | Units | Method | Reference | Comment |
ΔrG° | 330.3 ± 2.0 | kcal/mol | IMRE | Fujio, McIver, et al., 1981 | gas phase; value altered from reference due to change in acidity scale; B |

Van Den Dool and Kratz RI, non-polar column, temperature ramp

Data compiled by: NIST Mass Spectrometry Data Center, William E. Wallace, director

Column type CapillaryCapillaryPacked
Active phase HP-5MSDB-5SE-30
Column length (m) 60.30.
Carrier gas HeH2
Substrate   Celite
Column diameter (mm) 0.250.25
Phase thickness (μm) 0.250.25
Tstart (C) 40.50.75.
Tend (C) 310.290.228.
Heat rate (K/min) 3.4.
Initial hold (min) 1.
Final hold (min) 20.
I 1459.1465.1435.
ReferenceLalel, Singh, et al., 2003da Silva, Borba, et al., 1999van den Dool and Kratz, 1963
Comment MSDC-RI MSDC-RI MSDC-RI

Normal alkane RI, polar column, temperature ramp

Data compiled by: NIST Mass Spectrometry Data Center, William E. Wallace, director

Column type CapillaryCapillary
Active phase DB-WaxDB-Wax
Column length (m) 30.30.
Carrier gas HeHe
Substrate
Column diameter (mm) 0.250.25
Phase thickness (μm) 0.250.25
Tstart (C) 50.50.
Tend (C) 240.240.
Heat rate (K/min) 4.4.
Initial hold (min) 3.3.
Final hold (min) 10.10.
I 2911.2925.
ReferenceParada and Duque, 1998Parada and Duque, 1998
Comment MSDC-RI MSDC-RI

References

Manzo and Ahumanda, 1990
Manzo, R.H.; Ahumanda, A.A.,
Effects of solvent medium on solubility. V: Enthalpic and entropic contributions to the free energy changes of Di-substituted benzene derivatives in ethanol: Water and ethanol: Cyclohexane mixtures,
J. Pharm. Sci., 1990, 79, 12, 1109, https://doi.org/10.1002/jps.2600791214
. [all data]
Temprado, Roux, et al., 2005
Temprado, Manuel; Roux, Maria Victoria; Umnahanant, Patamaporn; Zhao, Hui; Chickos, James S.,
The Thermochemistry of 2,4-Pentanedione Revisited: Observance of a Nonzero Enthalpy of Mixing between Tautomers and Its Effects on Enthalpies of Formation,
J. Phys. Chem. B, 2005, 109, 25, 12590-12595, https://doi.org/10.1021/jp0515131
. [all data]
Perlovich, Rodionov, et al., 2005
Perlovich, German L.; Rodionov, Sergey V.; Bauer-Brandl, Annette,
Thermodynamics of solubility, sublimation and solvation processes of parabens,
European Journal of Pharmaceutical Sciences, 2005, 24, 1, 25-33, https://doi.org/10.1016/j.ejps.2004.09.007
. [all data]
Stephenson and Malanowski, 1987
Stephenson, Richard M.; Malanowski, Stanislaw,
Handbook of the Thermodynamics of Organic Compounds, 1987, https://doi.org/10.1007/978-94-009-3173-2
. [all data]
Giordano, Bettini, et al., 1999
Giordano, Ferdinando; Bettini, Ruggero; Donini, Cristina; Gazzaniga, Andrea; Caira, Mino R.; Zhang, Geoffrey G.Z.; Grant, David J.W.,
Physical properties of parabens and their mixtures: Solubility in water, thermal behavior, and crystal structures,
J. Pharm. Sci., 1999, 88, 11, 1210-1216, https://doi.org/10.1021/js9900452
. [all data]
Manzo and Ahumada, 1990
Manzo, Ruben H.; Ahumada, Amelia A.,
Effects of solvent medium on solubility. V: Enthalpic and entropic contributions to the free energy changes of Di-substituted benzene derivatives in ethanol: Water and ethanol: Cyclohexane mixtures,
J. Pharm. Sci., 1990, 79, 12, 1109-1115, https://doi.org/10.1002/jps.2600791214
. [all data]
Hunter and Lias, 1998
Hunter, E.P.; Lias, S.G.,
Evaluated Gas Phase Basicities and Proton Affinities of Molecules: An Update,
J. Phys. Chem. Ref. Data, 1998, 27, 3, 413-656, https://doi.org/10.1063/1.556018
. [all data]
Fujio, McIver, et al., 1981
Fujio, M.; McIver, R.T., Jr.; Taft, R.W.,
Effects on the acidities of phenols from specific substituent-solvent interactions. Inherent substituent parameters from gas phase acidities,
J. Am. Chem. Soc., 1981, 103, 4017. [all data]