N-acetyl-L-aspartic acid
- Formula: C6H9NO5
- Molecular weight: 175.1394
- IUPAC Standard InChIKey: OTCCIMWXFLJLIA-BYPYZUCNSA-N
- CAS Registry Number: 997-55-7
- Chemical structure:
View 3d structure (requires JavaScript / HTML 5) - Other names: N-acetyl-Asp

Reaction thermochemistry data

Data compiled by: Robert C. Dunbar
Individual Reactions
By formula: Na+ + C6H9NO5 = (Na+ • C6H9NO5)
Free energy of reaction
ΔrG° (kJ/mol) | T (K) | Method | Reference |
---|---|---|---|
146. | 0. | CIDC | Feng, Gronert, et al., 1999 |

Ion clustering data

Data compiled by: Robert C. Dunbar
Clustering reactions
By formula: Na+ + C6H9NO5 = (Na+ • C6H9NO5)
Free energy of reaction
ΔrG° (kJ/mol) | T (K) | Method | Reference |
---|---|---|---|
146. | 0. | CIDC | Feng, Gronert, et al., 1999 |

References

Feng, Gronert, et al., 1999
Feng, W.Y.; Gronert, S.; Lebrilla, C.B.,
Lithium and sodium ion binding energies of N-acetyl and N-glycyl amino acids,
J. Am. Chem. Soc., 1999, 121, 6, 1365, https://doi.org/10.1021/ja983116s
. [all data]