Benzenamine, 2-methoxy-5-nitro-
- Formula: C7H8N2O3
- Molecular weight: 168.1500
- IUPAC Standard InChIKey: NIPDVSLAMPAWTP-UHFFFAOYSA-N
- CAS Registry Number: 99-59-2
- Chemical structure:
View 3d structure (requires JavaScript / HTML 5) - Other names: o-Anisidine, 5-nitro-; Azoamine Scarlet K; 2-Amino-4-nitroanisole; 2-Methoxy-5-nitroaniline; 3-Nitro-6-methoxyaniline; 5-Nitro-o-anisidine; 5-Nitro-2-methoxyaniline; 4-Nitro-2-aminoanisole; NCI-C01934; 2-Amino-1-methoxy-4-nitrobenzene; 3-Amino-4-methoxynitrobenzene; Aniline, 2-methoxy-5-nitro-; o-Anisidine nitrate; Azoamine scarlet; Azogene ecarlate R; Azoic diazo component 13, base; C.I. Azoic diazo component 13; C.I. 37130; Fast scarlet R; 2-Methoxy-5-nitrobenzenamine; 1-Amino-2-methoxy-5-nitrobenzene; 1-Methoxy-2-amino-4-nitrobenzene; NSC 5510

Condensed phase thermochemistry data

Data compiled by: Hussein Y. Afeefy, Joel F. Liebman, and Stephen E. Stein
Quantity | Value | Units | Method | Reference | Comment |
---|---|---|---|---|---|
ΔfH°solid | -232. | kJ/mol | Ccb | Contineanu, Ionescu, et al., 1992 | |
Quantity | Value | Units | Method | Reference | Comment |
ΔcH°solid | -3666.0 ± 0.58 | kJ/mol | Ccb | Contineanu, Ionescu, et al., 1992 |

Van Den Dool and Kratz RI, non-polar column, custom temperature program

Column type | Active phase | I | Reference | Comment |
---|---|---|---|---|
Capillary | VF-5MS | 1764.4 | Tret'yakov, 2007 | 30. m/0.25 mm/0.25 μm, He; Program: Multi-step temperature program; T(initial)=60C; T(final)=270C |

References

Contineanu, Ionescu, et al., 1992
Contineanu, I.; Ionescu, T.; Marchidan, D.I.,
The enthalpies of combustion and formation of o-anisidine, o-acetanisidine, 4-nitro-o-anisidine and 5-nitro-o-anisidine,
Rev. Roum. Chim., 1992, 37, 1111-1116. [all data]
Lang (editor), 1975
Lang (editor), L.,
Absorption Spectra in the Ultraviolet and Visible Region, 1975, 20, 101. [all data]
Tret'yakov, 2007
Tret'yakov, K.V.,
Retention Data. NIST Mass Spectrometry Data Center., NIST Mass Spectrometry Data Center, 2007. [all data]