Benzenamine, 2-methyl-5-nitro-
- Formula: C7H8N2O2
- Molecular weight: 152.1506
- IUPAC Standard InChIKey: DSBIJCMXAIKKKI-UHFFFAOYSA-N
- CAS Registry Number: 99-55-8
- Chemical structure:
View 3d structure (requires JavaScript / HTML 5) - Other names: o-Toluidine, 5-nitro-; Amarthol Fast Scarlet G Base; Amarthol Fast Scarlet G Salt; Azoene fast scarlet gc base; Azoene fast scarlet gc salt; Azofix scarlet g salt; Azogene fast scarlet g; C.I. Azoic diazo component 12; C.I. 37105; Dainichi Fast Scarlet G Base; Daito scarlet base g; Devol scarlet b; Devol scarlet g salt; Diabase scarlet g; Diazo fast scarlet g; Fast red sg base; Fast scarlet base j; Fast scarlet g; Fast scarlet g base; Fast scarlet g salt; Fast scarlet gc base; Fast scarlet j salt; Fast Scarlet M 4NT Base; Fast scarlet t base; Hiltonil fast scarlet g base; Hiltonil fast scarlet g salt; Hiltonil fast scarlet gc base; Kayaku scarlet g base; Lake scarlet g base; Lithosol orange R base; Mitsui scarlet g base; Naphthanil scarlet g base; Naphtoelan fast scarlet g base; Naphtoelan fast scarlet g salt; PNOT; Scarlet base ciba II; Scarlet base irga II; Scarlet base NSP; Scarlet g base; Sugai fast scarlet g base; Symulon scarlet g base; 2-Amino-4-nitrotoluene; 2-Methyl-5-nitroaniline; 3-Nitro-6-methylaniline; 4-Nitro-2-aminotoluene; 5-Nitro-O-toluidine; 6-Methyl-3-nitroaniline; Azoic diazo component 12, base; Fast scarlet base G; NCI-C01843; 2-Methyl-5-nitrobenzenamine; 2-Methyl-5-nitro-benzeneamine; RCRA waste number U181; (2-Methyl-5-nitrophenyl)amine; 1-Methyl-2-amino-4-nitrobenzene; Conazoic Diazo AB; Azoene Fast Scarlet G Salt

Condensed phase thermochemistry data

Data compiled by: Hussein Y. Afeefy, Joel F. Liebman, and Stephen E. Stein
Quantity | Value | Units | Method | Reference | Comment |
---|---|---|---|---|---|
ΔcH°solid | -3809.3 ± 1.3 | kJ/mol | Ccb | Sullivan and Hunt, 1949 | |
ΔcH°solid | -3811.7 ± 1.4 | kJ/mol | Ccb | Sullivan, Kibler, et al., 1948 |

Lee's RI, non-polar column, temperature ramp

Column type | Active phase | I | Reference | Comment |
---|---|---|---|---|
Capillary | DB-5MS | 272.14 | Chen, Keeran, et al., 2002 | 30. m/0.25 mm/0.5 μm, 40. C @ 1. min, 10. K/min; Tend: 310. C |
Capillary | DB-5MS | 272.81 | Chen, Keeran, et al., 2002 | 30. m/0.25 mm/0.5 μm, 40. C @ 1. min, 4. K/min; Tend: 310. C |

References

Sullivan and Hunt, 1949
Sullivan, M.V.; Hunt, H.,
Heats of combustion. IV. The heats of combustion of five aromatic amines,
J. Phys. Chem., 1949, 53, 497-500. [all data]
Sullivan, Kibler, et al., 1948
Sullivan, M.V.; Kibler, G.M.; Hunt, H.,
Heats of combustion of nitrogen containing compounds, Rpt. Tech. Memo. PUR-3 for USN Project SQUID Contract N6ori-104, Task Order No. 1 Designation No. NR 22 042 by Purdue University, Lafayette, IN, 1948, 1-46. [all data]
Chen, Keeran, et al., 2002
Chen, P.H.; Keeran, W.S.; Van Ausdale, W.A.; Schindler, D.R.; Roberts, D.W.,
Application of Lee retention indices to the confirmation of tentatively identified compounds from GC/MS analysis of environmental samples, Technical paper, Analytical Services Division, Environmental ScienceEngineering, Inc, PO Box 1703, Gainesville, FL 32602, 2002, 11. [all data]