1-(2,4-Dimethylphenyl)ethanol
- Formula: C10H14O
- Molecular weight: 150.2176
- IUPAC Standard InChIKey: DNHQUGRUHBFDFT-UHFFFAOYSA-N
- CAS Registry Number: 99500-87-5
- Chemical structure:
View 3d structure (requires JavaScript / HTML 5) - Permanent link for this species. Use this link for bookmarking this species for future reference.

Normal alkane RI, non-polar column, temperature ramp

Column type | Active phase | I | Reference | Comment |
---|---|---|---|---|
Capillary | DB-5 | 1196. | Ali, Wurster, et al., 2008 | 30. m/0.25 mm/0.25 μm, Helium, 70. C @ 1. min, 3. K/min; Tend: 220. C |
Capillary | DB-5 | 1196. | Awadi Ali, Wurster, et al., 2008 | 70. C @ 1. min, 3. K/min; Column length: 30. m; Column diameter: 0.25 mm; Tend: 220. C |

References

Ali, Wurster, et al., 2008
Ali, N.A.A.; Wurster, M.; Arnold, N.; Teichert, A.; Schmidt, J.; Lindequist, U.; Wessjohann, L.,
Chemical composition and biological activities of essential oils from the oleogum resins of three endemic soqotraen Boswellia species,
Rec. Nat. Prod., 2008, 2, 1, 6-12. [all data]
Awadi Ali, Wurster, et al., 2008
Awadi Ali, N.A.; Wurster, M.; Arnold, N.; Teicher, A.; Schmidt, J.; Lindequist, U.; Wessjohann, L.,
Chemical composition and biological activity of essential oils from the Oleogum resins of three endemic soqotraen Boswellia species,
Rec. Nat. Prod., 2008, 2, 1, 6-12. [all data]