Carvone
- Formula: C10H14O
- Molecular weight: 150.2176
- IUPAC Standard InChIKey: ULDHMXUKGWMISQ-UHFFFAOYSA-N
- CAS Registry Number: 99-49-0
- Chemical structure:
View 3d structure (requires JavaScript / HTML 5) - Stereoisomers:
- Other names: 2-Cyclohexen-1-one, 2-methyl-5-(1-methylethenyl)-; p-Mentha-6,8-dien-2-one; Carvol; Karvon; 1-Carvone; δ(6,8)-(9)-Terpadienone-2; 2-Methyl-5-isopropenyl-2-cyclohexen-1-one; NCI-C55867; 2-Methyl-5-isopropenyl-2-cyclohexenone; 6,8(9)-p-Menthadien-2-one; 2-Methyl-5-(1-methylethenyl)-2-cyclohexene-1-one; DL-Carvone; (.+/-.)-Carvone; 2-Methyl-5-(1-methylethenyl)-2-cyclohexen-1-one; Limonen-6-one; NSC 6275; cis-Dihydrocarvone; Dihydrocarvone; (Z)-dihydrocarvone; (-)-carvone; (Z)-Carvone; (E)-Carvone; R-(-)-carvone; (R)-Carvone; t-carvone; 1(6),8-p-Menthadien-2-one; trans-Carvone; d-p-mentha-1(6),8-dien-2-one

Phase change data

Data compiled as indicated in comments:
TRC - Thermodynamics Research Center, NIST Boulder Laboratories, Chris Muzny director
Quantity | Value | Units | Method | Reference | Comment |
---|---|---|---|---|---|
Tboil | 502.15 | K | N/A | Kobe, Okabe, et al., 1941 | Uncertainty assigned by TRC = 0.5 K; TRC |
Tboil | 504.2 | K | N/A | Lecat, 1927 | Uncertainty assigned by TRC = 0.5 K; TRC |
Tboil | 504.10 | K | N/A | Lecat, 1926 | Uncertainty assigned by TRC = 0.5 K; TRC |
Antoine Equation Parameters
log10(P) = A − (B / (T + C))
P = vapor pressure (bar)
T = temperature (K)
View plot Requires a JavaScript / HTML 5 canvas capable browser.
Temperature (K) | A | B | C | Reference | Comment |
---|---|---|---|---|---|
330.6 to 500.7 | 5.02972 | 2348.261 | -33.473 | Stull, 1947 | Coefficents calculated by NIST from author's data. |

Kovats' RI, non-polar column, isothermal

Column type | Active phase | Temperature (C) | I | Reference | Comment |
---|---|---|---|---|---|
Capillary | SE-30 | 100. | 1225.8 | Tudor, 1997 | 40. m/0.35 mm/0.35 μm |
Capillary | PB-1 | 130. | 1230. | Engewald, Knobloch, et al., 1991 | Column length: 42. m; Column diameter: 0.32 mm |

Kovats' RI, non-polar column, temperature ramp

Column type | Active phase | I | Reference | Comment |
---|---|---|---|---|
Capillary | DB-5MS | 1243. | Angioni, Barra, et al., 2006 | 30. m/0.25 mm/0.25 μm, He, 3. K/min, 180. C @ 15. min; Tstart: 60. C |
Capillary | DB-5 | 1244. | Lucero, Fredrickson, et al., 2006 | 30. m/0.25 mm/0.25 μm, He, 3. K/min; Tstart: 60. C |
Capillary | DB-5 | 1243. | Adams, Morris, et al., 2005 | 30. m/0.26 mm/0.25 μm, He, 3. K/min; Tstart: 60. C; Tend: 246. C |
Capillary | DB-5 | 1242. | Adams and Nguyen, 2005 | 30. m/0.26 mm/0.25 μm, He, 3. K/min; Tstart: 60. C; Tend: 246. C |
Capillary | DB-5 | 1246. | Barbosa, Paula, et al., 2005 | 30. m/0.25 mm/0.25 μm, He, 3. K/min, 240. C @ 15. min; Tstart: 60. C |
Capillary | BP-5 | 1249. | Baranauskiene, Venskutonis, et al., 2005 | 50. m/0.32 mm/0.25 μm, He, 50. C @ 2. min, 5. K/min, 260. C @ 5. min |
Capillary | DB-5MS | 1243. | Maia, Andrade, et al., 2005 | 30. m/0.25 mm/0.25 μm, He, 3. K/min; Tstart: 60. C; Tend: 240. C |
Capillary | SPB-5 | 1250. | Gauvin, Lecomte, et al., 2004 | 60. m/0.32 mm/1. μm, He, 4. K/min, 200. C @ 30. min; Tstart: 60. C |
Capillary | DB-5 | 1248. | Merle, Morón, et al., 2004 | 25. m/0.25 mm/0.25 μm, He, 60. C @ 6. min, 5. K/min, 180. C @ 15. min |
Capillary | DB-5 | 1240. | Amparo Blázquez, Pérez, et al., 2003 | He, 40. C @ 5. min, 3. K/min, 280. C @ 5. min; Column length: 25. m; Column diameter: 0.25 mm |
Capillary | DB-5 | 1252. | Baranauskiene, Venskutonis, et al., 2003 | 50. m/0.32 mm/0.25 μm, He, 50. C @ 2. min, 5. K/min, 280. C @ 10. min |
Capillary | HP-5MS | 1231. | Gkinis, Tzakou, et al., 2003 | 30. m/0.25 mm/0.25 μm, He, 3. K/min; Tstart: 60. C; Tend: 280. C |
Capillary | BP-1 | 1211. | Srivastava, Ahmad, et al., 2003 | 25. m/0.55 mm/0.25 μm, N2, 5. K/min, 220. C @ 15. min; Tstart: 60. C |
Capillary | SE-30 | 1218. | Juliani, Koroch, et al., 2002 | He, 4. K/min; Column length: 30. m; Column diameter: 0.25 mm; Tstart: 60. C; Tend: 240. C |
Capillary | CP Sil 5 CB | 1215. | Kasali, Adio, et al., 2002 | He, 3. K/min; Column length: 25. m; Column diameter: 0.25 mm; Tstart: 50. C; Tend: 230. C |
Capillary | BP-1 | 1220. | Raina, Srivastava, et al., 2002 | 25. m/0.32 mm/0.25 μm, N2, 5. K/min, 220. C @ 15. min; Tstart: 60. C |
Capillary | BP-1 | 1217. | Raina, Srivastava, et al., 2002, 2 | 25. m/0.55 mm/0.25 μm, N2, 5. K/min, 220. C @ 15. min; Tstart: 60. C |
Capillary | HP-5MS | 1242. | Salido, Altarejos, et al., 2002 | 30. m/0.25 mm/0.25 μm, He, 3. K/min; Tstart: 50. C; Tend: 250. C |
Capillary | PTE-5 | 1243. | Gudzic, Dordevic, et al., 2001 | 60. m/0.32 mm/0.39 μm, H2, 4.3 K/min; Tstart: 60. C; Tend: 285. C |
Capillary | PTE-5 | 1245. | Gudzic, Dordevic, et al., 2001 | 60. m/0.32 mm/0.39 μm, H2, 4.3 K/min; Tstart: 60. C; Tend: 285. C |
Capillary | BP-1 | 1218. | Jain, Srivastava, et al., 2001 | 25. m/0.55 mm/0.25 μm, N2, 5. K/min, 220. C @ 15. min; Tstart: 60. C |
Capillary | HP-5 | 1242. | Tzakou and Couladis, 2001 | 30. m/0.25 mm/0.25 μm, He, 3. K/min; Tstart: 60. C; Tend: 280. C |
Capillary | DB-5 | 1242. | Adams, 2000 | 30. m/0.26 mm/0.25 μm, He, 3. K/min; Tstart: 60. C; Tend: 240. C |
Capillary | SE-54 | 1242. | Adams, 2000, 2 | 30. m/0.26 mm/0.25 μm, 3. K/min; Tstart: 60. C; Tend: 246. C |
Capillary | DB-5 | 1242. | Adams, 2000, 3 | 30. m/0.26 mm/0.25 μm, He, 3. K/min; Tstart: 60. C; Tend: 246. C |
Capillary | DB-5 | 1248. | Tzakou, Harvala, et al., 2000 | 50. C @ 5. min, 3. K/min; Column length: 30. m; Column diameter: 0.32 mm; Tend: 250. C |
Capillary | Methyl Silicone | 1210. | Adegoke, Rao, et al., 1998 | 30. m/0.32 mm/0.25 μm, He, 60. C @ 2. min, 2. K/min, 250. C @ 5. min |
Capillary | DB-1 | 1220. | Bylaite, Venskutonis, et al., 1998 | 60. m/0.25 mm/0.25 μm, He, 50. C @ 5. min, 3. K/min, 250. C @ 10. min |
Capillary | DB-5 | 1240. | Zoghbi, Andrade, et al., 1998 | 30. m/0.25 mm/0.25 μm, He, 4. K/min; Tstart: 60. C; Tend: 240. C |
Capillary | DB-5 | 1198. | Zoghbi, Andrade, et al., 1998 | 30. m/0.25 mm/0.25 μm, He, 4. K/min; Tstart: 60. C; Tend: 240. C |
Capillary | BPX-5 | 1242. | Fournier, Hadjiakhoondi, et al., 1997 | 50. m/0.22 mm/0.25 μm, N2, 60. C @ 10. min, 2. K/min; Tend: 185. C |
Capillary | DB-5 | 1243. | Tellez, Estell, et al., 1997 | 30. m/0.25 mm/0.25 μm, He, 3. K/min; Tstart: 60. C; Tend: 240. C |
Capillary | DB-5 | 1241. | Loayza, Abujder, et al., 1995 | 40. C @ 2. min, 2. K/min, 210. C @ 120. min; Column length: 30. m |

Kovats' RI, non-polar column, custom temperature program

Column type | Active phase | I | Reference | Comment |
---|---|---|---|---|
Capillary | DB-5 | 1242. | Adams, 1998 | 30. m/0.26 mm/0.25 μm; Program: not specified |
Capillary | DB-5 | 1195. | Roscigno, 1998 | 30. m/0.25 mm/0.25 μm; Program: 50C(5min) => 2C/min => 250C (60min) => 2C/min => 270C => 1C/min => 290C |
Capillary | DB-5 | 1239. | Santos, Andrade, et al., 1998 | 30. m/0.25 mm/0.25 μm, He; Program: 40C => 2C/min => 60C => 4C/min => 240C |
Capillary | BP-1 | 1223. | MacLeod, MacLeod, et al., 1988 | Column length: 25. m; Column diameter: 0.2 mm; Program: not specified |

Kovats' RI, polar column, temperature ramp

Column type | Active phase | I | Reference | Comment |
---|---|---|---|---|
Capillary | Supelcowax-10 | 1713. | Tzakou and Couladis, 2001 | 30. m/0.32 mm/0.25 μm, He, 3. K/min; Tstart: 75. C; Tend: 230. C |
Capillary | Supelcowax-10 | 1730. | Loayza, Abujder, et al., 1995 | 40. C @ 2. min, 2. K/min, 210. C @ 120. min; Column length: 30. m |
Capillary | DB-Wax | 1728. | Umano, Hagi, et al., 1994 | He, 40. C @ 2. min, 2. K/min; Column length: 60. m; Column diameter: 0.25 mm; Tend: 200. C |
Capillary | DB-Wax | 1745. | Umano and Shibamoto, 1988 | 40. C @ 10. min, 2. K/min; Column length: 60. m; Column diameter: 0.25 mm; Tend: 220. C |

Van Den Dool and Kratz RI, non-polar column, temperature ramp

Column type | Active phase | I | Reference | Comment |
---|---|---|---|---|
Capillary | HP-5MS | 1240. | Benkaci-Ali, Baaliouamer, et al., 2007 | 30. m/0.25 mm/0.25 μm, He, 60. C @ 8. min, 2. K/min, 250. C @ 30. min |
Capillary | CP-Sil PONA GB | 1229. | Cunicao, Lopes, et al., 2007 | 100. m/0.25 mm/0.25 μm, He, 140. C @ 10. min, 5. K/min, 230. C @ 25. min |
Capillary | BP-1 | 1213. | Duquesnoy, Castola, et al., 2007 | 50. m/0.22 mm/0.25 μm, He, 2. K/min, 220. C @ 20. min; Tstart: 60. C |
Capillary | DB-5 | 1246. | Flamini, Cioni, et al., 2007 | 30. m/0.25 mm/0.25 μm, He, 3. K/min; Tstart: 60. C; Tend: 240. C |
Capillary | HP-5MS | 1243. | Kundakovic, Fokialakis, et al., 2007 | 30. m/0.25 mm/0.25 μm, He, 3. K/min; Tstart: 60. C; Tend: 280. C |
Capillary | RTX-1 | 1215. | Muselli, Rossi, et al., 2007 | 60. m/0.22 mm/0.25 μm, He, 2. K/min, 230. C @ 30. min; Tstart: 60. C |
Capillary | HP-101 | 1207. | Politeo, Jukic, et al., 2007 | 25. m/0.2 mm/0.2 μm, He, 70. C @ 2. min, 3. K/min, 200. C @ 15. min |
Capillary | Equity-5 | 1282. | Rocha, Coelho, et al., 2007 | 60. m/0.25 mm/1. μm, He, 40. C @ 1. min, 5. K/min, 260. C @ 15. min |
Capillary | HP-5MS | 1244. | Vagionas, Ngassapa, et al., 2007 | 30. m/0.25 mm/0.25 μm, He, 3. K/min; Tstart: 60. C; Tend: 280. C |
Capillary | BP-1 | 1213. | Bousmaha, Boti, et al., 2006 | 50. m/0.25 mm/0.25 μm, He, 2. K/min, 220. C @ 20. min; Tstart: 60. C |
Capillary | DB-5 | 1281. | Bylaite and Meyer, 2006 | 30. m/0.25 mm/1. μm, 50. C @ 1. min, 10. K/min, 290. C @ 10. min |
Capillary | HP-5MS | 1192. | Chorianopoulos N., Evergets E., et al., 2006 | 30. m/0.25 mm/0.25 μm, He, 3. K/min; Tstart: 60. C; Tend: 280. C |
Capillary | DB-5 | 1243. | Dob, Dahmane, et al., 2006 | 30. m/0.25 mm/0.25 μm, N2, 60. C @ 3. min, 3. K/min, 240. C @ 3. min |
Capillary | DB-5 | 1242. | Esmaeili, Nematollahi, et al., 2006 | 50. m/0.2 mm/0.32 μm, N2, 60. C @ 3. min, 5. K/min, 220. C @ 5. min |
Capillary | BP-1 | 1221. | Gonny, Cavaleiro, et al., 2006 | 50. m/0.22 mm/0.25 μm, He, 2. K/min, 220. C @ 20. min; Tstart: 60. C |
Capillary | DB-1 | 1255. | Rezazadeh, Hamedani, et al., 2006 | 30. m/0.25 mm/0.25 μm, He, 4. K/min; Tstart: 60. C; Tend: 240. C |
Capillary | DB-1 | 1199. | Rezazadeh, Hamedani, et al., 2006 | 30. m/0.25 mm/0.25 μm, He, 4. K/min; Tstart: 60. C; Tend: 240. C |
Capillary | HP-5 | 1242. | Rezazadeh, Hamedani, et al., 2006 | 25. m/0.25 mm/0.25 μm, He, 4. K/min; Tstart: 60. C; Tend: 240. C |
Capillary | HP-5 | 1193. | Rezazadeh, Hamedani, et al., 2006 | 25. m/0.25 mm/0.25 μm, He, 4. K/min; Tstart: 60. C; Tend: 240. C |
Capillary | SPB-1 | 1211. | Salgueiro L.R., Pinto E., et al., 2006 | 30. m/0.2 mm/0.2 μm, He, 3. K/min, 220. C @ 15. min; Tstart: 70. C |
Capillary | HP-5MS | 1242. | Saroglou, Dorizas, et al., 2006 | 30. m/0.25 mm/0.25 μm, He, 60. C @ 5. min, 4. K/min; Tend: 280. C |
Capillary | HP-5MS | 1237. | Vujisic L., Vuckovic I., et al., 2006 | 30. m/0.25 mm/0.25 μm, H2, 4.3 K/min; Tstart: 50. C; Tend: 285. C |
Capillary | DB-5 | 1244. | Zeller and Rychlik, 2006 | 30. m/0.32 mm/0.25 μm, He, 40. C @ 1. min, 6. K/min; Tend: 230. C |
Capillary | CP Sil 5 CB | 1214. | Ziegenbein, Hanssen, et al., 2006 | H2, 10. K/min; Column length: 25. m; Column diameter: 0.25 mm; Tstart: 80. C; Tend: 270. C |
Capillary | SE-54 | 1262. | Brantner, Pfeifhofer, et al., 2005 | 50. m/0.25 mm/0.27 μm, H2, 5. K/min; Tstart: 50. C; Tend: 300. C |
Capillary | HP-5 | 1243. | Cioni, Flamini, et al., 2005 | 30. m/0.25 mm/0.25 μm, N2, 60. C @ 10. min, 5. K/min; Tend: 220. C |
Capillary | RTX-1 | 1218. | Cozzani, Muselli, et al., 2005 | 60. m/0.22 mm/0.25 μm, 2. K/min, 220. C @ 20. min; Tstart: 60. C |
Capillary | DB-1 | 1210. | Dob T., Berramdane T., et al., 2005 | 30. m/0.32 mm/0.25 μm, N2, 50. C @ 3. min, 2. K/min, 260. C @ 5. min |
Capillary | MDN-5 | 1240. | Dugo, Mondello, et al., 2005 | 30. m/0.25 mm/0.25 μm, He, 3. K/min; Tstart: 50. C; Tend: 250. C |
Capillary | HP-5 | 1245. | Javidnia, Miri, et al., 2005 | 30. m/0.25 mm/0.25 μm, He, 3. K/min; Tstart: 60. C; Tend: 260. C |
Capillary | HP-5 | 1244. | Mahattanatawee, Goodner, et al., 2005 | 30. m/0.25 mm/0.25 μm, He, 50. C @ 5. min, 4. K/min, 250. C @ 15. min |
Capillary | HP-5 | 1243. | Mahattanatawee, Goodner, et al., 2005 | 30. m/0.25 mm/0.25 μm, He, 50. C @ 5. min, 4. K/min, 250. C @ 15. min |
Capillary | HP-5MS | 1242. | Pino, Mesa, et al., 2005 | 30. m/0.25 mm/0.25 μm, He, 60. C @ 2. min, 4. K/min, 250. C @ 20. min |
Capillary | SE-54 | 1194. | Simionatto, Porto, et al., 2005 | 25. m/0.25 mm/0.2 μm, H2, 4. K/min; Tstart: 50. C; Tend: 250. C |
Capillary | HP-5MS | 1243. | Smadja, Rondeau, et al., 2005 | 60. m/0.2 mm/0.25 μm, He, 2. K/min, 200. C @ 10. min; Tstart: 60. C |
Capillary | Mega 5MS | 1229. | Verzera, Trozzi, et al., 2005 | 30. m/0.25 mm/0.25 μm, He, 40. C @ 2. min, 3. K/min; Tend: 240. C |
Capillary | SE-54 | 1239. | Alma, Nitz, et al., 2004 | 30. m/0.25 mm/0.25 μm, He, 60. C @ 5. min, 2. K/min; Tend: 260. C |
Capillary | SPB-1 | 1212. | Antunes, Sevinate-Pinto, et al., 2004 | 30. m/0.25 mm/0.25 μm, He, 3. K/min, 220. C @ 15. min; Tstart: 70. C |
Capillary | SPB-1 | 1211. | Cavaleiro, Salgueiro, et al., 2004 | 30. m/0.2 mm/0.2 μm, He, 3. K/min, 220. C @ 15. min; Tstart: 70. C |
Capillary | HP-5MS | 1241. | Chorianopoulos, Kalpoutzakis, et al., 2004 | 30. m/0.25 mm/0.25 μm, He, 3. K/min; Tstart: 60. C; Tend: 280. C |
Capillary | HP-5MS | 1192. | Chorianopoulos, Kalpoutzakis, et al., 2004 | 30. m/0.25 mm/0.25 μm, He, 3. K/min; Tstart: 60. C; Tend: 280. C |
Capillary | HP-5 | 1243. | Javidnia, Miri, et al., 2004 | He, 3. K/min; Column length: 30. m; Column diameter: 0.25 mm; Tstart: 60. C; Tend: 260. C |
Capillary | RSL-200 | 1258. | Ngassoum, Ousmaila, et al., 2004 | 30. m/0.32 mm/0.25 μm, H2, 40. C @ 5. min, 6. K/min, 280. C @ 5. min |
Capillary | HP-5 | 1241. | Sartoratto, Machado, et al., 2004 | 25. m/0.2 mm/0.33 μm, He, 3. K/min, 240. C @ 7. min; Tstart: 60. C |
Capillary | HP-5 | 1246. | Siegmund, Derler, et al., 2004 | 30. m/0.25 mm/1. μm, -30. C @ 1. min, 10. K/min; Tend: 250. C |
Capillary | HP-5 | 1245. | Stashenko, Jaramillo, et al., 2004 | 50. m/0.2 mm/0.2 μm, He, 35. C @ 15. min, 3. K/min, 250. C @ 40. min |
Capillary | Optima 5 | 1236. | Vérité, Nacer, et al., 2004 | 25. m/0.25 mm/0.25 μm, He, 3. K/min, 280. C @ 20. min; Tstart: 60. C |
Capillary | DB-5 | 1245. | Bader, Flamini, et al., 2003 | 30. m/0.25 mm/0.25 μm, He, 3. K/min; Tstart: 60. C; Tend: 240. C |
Capillary | RTX-1 | 1217. | Cavalli, Tomi, et al., 2003 | 60. m/0.22 mm/0.25 μm, He, 2. K/min, 230. C @ 45. min; Tstart: 60. C |
Capillary | SPB-1 | 1218. | Chisholm, Jell, et al., 2003 | 30. m/0.25 mm/0.25 μm, He, 35. C @ 5. min, 4. K/min, 225. C @ 20. min |
Capillary | DB-5 | 1244. | Flamini, Luigi Cioni, et al., 2003 | 30. m/0.25 mm/0.25 μm, He, 3. K/min; Tstart: 60. C; Tend: 240. C |
Capillary | HP-5 | 1244. | Macchioni, Cioni, et al., 2003 | 30. m/0.25 mm/0.25 μm, He, 3. K/min; Tstart: 60. C; Tend: 240. C |
Capillary | HP-5MS | 1243. | Mimica-Dukic, Kujundzic, et al., 2003 | 30. m/0.25 mm/0.25 μm, He, 3. K/min; Tstart: 60. C; Tend: 280. C |
Capillary | CP Sil 5 CB | 1211. | Pino, Almora, et al., 2003 | 60. m/0.32 mm/0.25 μm, He, 60. C @ 10. min, 3. K/min, 280. C @ 60. min |
Capillary | DB-1 | 1205.7 | Sun and Stremple, 2003 | 30. m/0.25 mm/0.25 μm, He, 3. K/min; Tstart: 40. C; Tend: 325. C |
Capillary | HP-5 | 1242. | Tsiri, Kretsi, et al., 2003 | 30. m/0.25 mm/0.25 μm, He, 3. K/min; Tstart: 60. C; Tend: 280. C |
Capillary | HP-5 | 1253. | Tsiri, Kretsi, et al., 2003 | 30. m/0.25 mm/0.25 μm, He, 3. K/min; Tstart: 60. C; Tend: 280. C |
Capillary | Mega 5MS | 1229. | Verzera, Trozzi, et al., 2003 | 30. m/0.25 mm/0.25 μm, He, 40. C @ 2. min, 3. K/min; Tend: 240. C |
Capillary | HP-5MS | 1244. | Afsharypuor and Suleimany, 2002 | 30. m/0.25 mm/0.25 μm, He, 4. K/min; Tstart: 60. C; Tend: 275. C |
Capillary | DB-5 | 1242. | Economakis, Skaltsa, et al., 2002 | 30. m/0.25 mm/0.25 μm, 50. C @ 5. min, 3. K/min; Tend: 280. C |
Capillary | DB-5 | 1193. | Economakis, Skaltsa, et al., 2002 | 30. m/0.25 mm/0.25 μm, 50. C @ 5. min, 3. K/min; Tend: 280. C |
Capillary | DB-5 | 1242. | Javidnia, Miri, et al., 2002 | 30. m/0.25 mm/0.25 μm, He, 4. K/min; Tstart: 60. C; Tend: 260. C |
Capillary | HP-1 | 1211. | Nath, Sarma, et al., 2002 | 24. m/0.32 mm/0.17 μm, He, 60. C @ 2. min, 4. K/min, 250. C @ 20. min |
Capillary | CP Sil 5 CB | 1207. | Pino, Marbot, et al., 2002 | 25. m/0.25 mm/0.25 μm, N2, 60. C @ 6. min, 4. K/min; Tend: 280. C |
Capillary | CP Sil 5 CB | 1207. | Pino, Marbot, et al., 2002, 2 | 30. m/0.25 mm/0.25 μm, H2, 60. C @ 10. min, 2. K/min, 280. C @ 40. min |
Capillary | RTX-5 | 1242. | Shellie, Mondello, et al., 2002 | 30. m/0.25 mm/0.25 μm, He, 45. C @ 6. min, 3. K/min; Tend: 250. C |
Capillary | RTX-5 | 1254. | Shellie, Mondello, et al., 2002 | 30. m/0.25 mm/0.25 μm, He, 45. C @ 6. min, 3. K/min; Tend: 250. C |
Capillary | HP-5 | 1240. | Aligiannis, Kalpoutzakis, et al., 2001 | 30. m/0.25 mm/0.25 μm, He, 60. C @ 5. min, 3. K/min; Tend: 280. C |
Capillary | HP-5 | 1241. | Couladis, Tsortanidou, et al., 2001 | 30. m/0.25 mm/0.25 μm, He, 3. K/min; Tstart: 60. C; Tend: 380. C |
Capillary | HP-5MS | 1242. | Giamakis, Kretsi, et al., 2001 | 30. m/0.25 mm/0.25 μm, He, 60. C @ 5. min, 3. K/min; Tend: 280. C |
Capillary | HP-1 | 1226. | Guilliard, Delgado, et al., 2001 | 60. m/0.25 mm/0.25 μm, He, 50. C @ 5. min, 2.5 K/min; Tend: 250. C |
Capillary | HP-5 | 1242. | Guilliard, Delgado, et al., 2001 | 50. m/0.25 mm/0.25 μm, He, 50. C @ 5. min, 2.5 K/min; Tend: 250. C |
Capillary | HP-5 | 1193. | Guilliard, Delgado, et al., 2001 | 50. m/0.25 mm/0.25 μm, He, 50. C @ 5. min, 2.5 K/min; Tend: 250. C |
Capillary | DB-5 | 1242. | Nogueira, Bittrich, et al., 2001 | 30. m/0.25 mm/0.25 μm, H2, 3. K/min; Tstart: 60. C; Tend: 240. C |
Capillary | CP Sil 5 CB | 1211. | Pino and Marbot, 2001 | 50. m/0.32 mm/0.4 μm, He, 60. C @ 10. min, 3. K/min, 280. C @ 60. min |
Capillary | HP-5MS | 1241. | Skaltsa, Mavrommati, et al., 2001 | 30. m/0.25 mm/0.25 μm, He, 60. C @ 5. min, 4. K/min; Tend: 280. C |
Capillary | BPX-5 | 1271. | Zabaras and Wyllie, 2001 | 50. m/0.22 mm/0.25 μm, H2, 60. C @ 5. min, 4. K/min, 180. C @ 5. min |
Capillary | BPX-5 | 1222. | Zabaras and Wyllie, 2001 | 50. m/0.22 mm/0.25 μm, H2, 60. C @ 5. min, 4. K/min, 180. C @ 5. min |
Capillary | HP-5 | 1254. | Kim, Thuy, et al., 2000 | 30. m/0.25 mm/0.25 μm, He, 40. C @ 5. min, 2. K/min, 200. C @ 20. min |
Capillary | HP-5 | 1195. | Kim, Thuy, et al., 2000 | 30. m/0.25 mm/0.25 μm, He, 40. C @ 5. min, 2. K/min, 200. C @ 20. min |
Capillary | HP-5 | 1251. | Kim, Thuy, et al., 2000 | 30. m/0.25 mm/0.25 μm, He, 40. C @ 5. min, 2. K/min, 200. C @ 20. min |
Capillary | HP-5 | 1186. | Kim, Thuy, et al., 2000 | 30. m/0.25 mm/0.25 μm, He, 40. C @ 5. min, 2. K/min, 200. C @ 20. min |
Capillary | HP-5 | 1234. | Song, Sawamura, et al., 2000 | 30. m/0.25 mm/0.25 μm, He, 2. K/min; Tstart: 70. C; Tend: 230. C |
Capillary | DB-5 | 1243. | Song, Sawamura, et al., 2000, 2 | 30. m/0.25 mm/0.25 μm, N2, 2. K/min; Tstart: 70. C; Tend: 230. C |
Capillary | Mega 5MS | 1229. | Verzera, la Rosa, et al., 2000 | 30. m/0.25 mm/0.25 μm, He, 40. C @ 2. min, 3. K/min; Tend: 240. C |
Capillary | Mega 5MS | 1229. | Verzera, Trozzi, et al., 2000 | 30. m/0.25 mm/0.25 μm, He, 40. C @ 2. min, 3. K/min; Tend: 240. C |
Capillary | OV-101 | 1223. | Menut, Bessiere, et al., 1999 | N2, 5. K/min; Column length: 25. m; Column diameter: 0.25 mm; Tstart: 50. C; Tend: 200. C |
Capillary | DB-1 | 1211. | Muselli, Hoi, et al., 1999 | 30. m/0.25 mm/0.25 μm, 50. C @ 3. min, 3. K/min; Tend: 220. C |
Capillary | CP Sil 5 CB | 1222. | Weyerstahl, Marschall, et al., 1999 | He, 5. K/min; Column length: 25. m; Column diameter: 0.25 mm; Tstart: 60. C; Tend: 260. C |
Capillary | OV-1 | 1204. | Bicchi, Rubiolo, et al., 1998 | 25. m/0.25 mm/0.3 μm, 50. C @ 1. min, 3. K/min, 200. C @ 20. min |
Capillary | BP-1 | 1213. | Mariotti, Tomi, et al., 1997 | 50. m/0.22 mm/0.25 μm, He, 2. K/min, 230. C @ 35. min; Tstart: 60. C |
Capillary | DB-5 | 1239. | Sagrero-Nieves, Bartley, et al., 1997 | 30. m/0.26 mm/0.25 μm, He, 2. K/min, 225. C @ 20. min; Tstart: 50. C |
Capillary | Methyl Silicone | 1227. | Píry, Príbela, et al., 1995 | 25. m/0.2 mm/0.3 μm, He, 2. K/min; Tstart: 40. C; Tend: 200. C |
Capillary | OV-101 | 1220. | Chisholm, Guiher, et al., 1994 | 35. C @ 3. min, 6. K/min; Column length: 15. m; Column diameter: 0.32 mm; Tend: 250. C |
Capillary | OV-101 | 1220. | Yang, Sugisawa, et al., 1992 | N2, 2. K/min; Column length: 50. m; Column diameter: 0.25 mm; Tstart: 80. C; Tend: 200. C |
Capillary | OV-101 | 1224. | Yang, Sugisawa, et al., 1992 | N2, 2. K/min; Column length: 50. m; Column diameter: 0.25 mm; Tstart: 80. C; Tend: 200. C |
Capillary | HP-1 | 1187. | Tang, Zhang, et al., 1990 | 50. m/0.32 mm/1.05 μm, He, 2. K/min, 230. C @ 40. min; Tstart: 40. C |
Capillary | OV-101 | 1213. | Pieribattesti, Smadja, et al., 1988 | H2, 2. K/min; Column length: 50. m; Column diameter: 0.32 mm; Tstart: 50. C; Tend: 200. C |

Van Den Dool and Kratz RI, non-polar column, custom temperature program

Column type | Active phase | I | Reference | Comment |
---|---|---|---|---|
Capillary | BPX-5 | 1217. | Dharmawan, Kasapis, et al., 2007 | 30. m/0.25 mm/0.25 μm, He; Program: 35C => 4C/min => 200C => 30C/min => 300C (3min) |
Capillary | HP-5MS | 1239. | Pérez, Navarro, et al., 2007 | 30. m/0.25 mm/0.25 μm, He; Program: 50C(4min) => 10C/min => 200C(0.5min) => 20C/min => 260C(5min) |
Capillary | BPX-5 | 1265. | Cardeal, da Silva, et al., 2006 | 30. m/0.25 mm/0.25 μm; Program: 35C(5min) => 3C/min => 210C => 40C/min => 240C (4min) |
Capillary | BPX-5 | 1224. | Cardeal, da Silva, et al., 2006 | 30. m/0.25 mm/0.25 μm; Program: 35C(5min) => 3C/min => 210C => 40C/min => 240C (4min) |
Capillary | 5 % Phenyl methyl siloxane | 1243. | Sacchetti, Maietti, et al., 2005 | 30. m/0.32 mm/0.15 μm, He; Program: 45C => 1C/min => 100C => 5C/min => 250C (10min) |
Capillary | 5 % Phenyl methyl siloxane | 1193. | Sacchetti, Maietti, et al., 2005 | 30. m/0.32 mm/0.15 μm, He; Program: 45C => 1C/min => 100C => 5C/min => 250C (10min) |
Capillary | SE-52 | 1200. | Lorenzo, Paz, et al., 2001 | 30. m/0.32 mm/0.40 μm, H2; Program: 60 0C (8 min) 3 K/min -> 180 0C 20 K/min -> 250 0C (10 min) |
Capillary | DB-5 | 1235. | Boulanger, Chassagne, et al., 1999 | 30. m/0.25 mm/0.25 μm, H2; Program: 40C(5min) => 2C/min => 220C => 5C/min => 250C(15min) |
Capillary | DB-5 | 1242. | Boulanger, Chassagne, et al., 1999 | 30. m/0.25 mm/0.25 μm, H2; Program: 40C(5min) => 2C/min => 220C => 5C/min => 250C(15min) |
Capillary | DB-5 | 1240. | Afsharypuor, Jeiran, et al., 1998 | 25. m/0.25 mm/0.25 μm, He; Program: 60C => 3C/min => 106C => 6C/min => 280C |
Capillary | SE-52 | 1200. | Mondello, Dugo, et al., 1995 | 60. m/0.32 mm/0.40 μm, He; Program: 45 C (6 min) 3 C/min -> 111 0C 2 C/min -> 160 C 3 C/min -> 300 C (15 min) |
Capillary | SE-52 | 1246. | Mondello, Dugo, et al., 1995 | 60. m/0.32 mm/0.40 μm, He; Program: 45 C (6 min) 3 C/min -> 111 0C 2 C/min -> 160 C 3 C/min -> 300 C (15 min) |

Van Den Dool and Kratz RI, polar column, temperature ramp

Column type | Active phase | I | Reference | Comment |
---|---|---|---|---|
Capillary | BP-20 | 1749. | Duquesnoy, Castola, et al., 2007 | 50. m/0.22 mm/0.25 μm, He, 2. K/min, 220. C @ 20. min; Tstart: 60. C |
Capillary | HP-Innowax | 1749. | Kundakovic, Fokialakis, et al., 2007 | 30. m/0.25 mm/0.25 μm, He, 3. K/min; Tstart: 60. C; Tend: 280. C |
Capillary | RTX-Wax | 1699. | Muselli, Rossi, et al., 2007 | 60. m/0.22 mm/0.25 μm, He, 2. K/min, 230. C @ 30. min; Tstart: 60. C |
Capillary | BP-20 | 1732. | Bousmaha, Boti, et al., 2006 | 50. m/0.25 mm/0.25 μm, He, 2. K/min, 220. C @ 20. min; Tstart: 60. C |
Capillary | Polyethylene Glycol | 1715. | Dob, Dahmane, et al., 2006 | 30. m/0.32 mm/0.25 μm, N2, 50. C @ 10. min, 2. K/min, 230. C @ 15. min |
Capillary | BP-20 | 1741. | Gonny, Cavaleiro, et al., 2006 | 50. m/0.22 mm/0.25 μm, He, 2. K/min, 220. C @ 20. min; Tstart: 60. C |
Capillary | DB-Wax | 1718. | Osorio, Alarcon, et al., 2006 | 30. m/0.25 mm/0.25 μm, He, 50. C @ 4. min, 4. K/min, 220. C @ 20. min |
Capillary | DB-Wax | 1736. | Pala-Paul, Copeland, et al., 2006 | 60. m/0.32 mm/0.25 μm, He, 3. K/min; Tstart: 35. C; Tend: 220. C |
Capillary | Supelcowax-10 | 1728. | Salgueiro L.R., Pinto E., et al., 2006 | 30. m/0.2 mm/0.2 μm, He, 3. K/min, 220. C @ 15. min; Tstart: 70. C |
Capillary | DB-FFAP | 1735. | Zeller and Rychlik, 2006 | 30. m/0.32 mm/0.25 μm, He, 40. C @ 1. min, 6. K/min; Tend: 230. C |
Capillary | RTX-Wax | 1704. | Cozzani, Muselli, et al., 2005 | 60. m/0.22 mm/0.25 μm, 2. K/min, 220. C @ 20. min; Tstart: 60. C |
Capillary | DB-Wax | 1744. | Njoroge, Koaze, et al., 2005 | 60. m/0.25 mm/0.25 μm, N2, 70. C @ 2. min, 2. K/min, 230. C @ 20. min |
Capillary | Carbowax 20M | 1714. | Verzera, Campisi, et al., 2005 | 60. m/0.25 mm/0.25 μm, He, 45. C @ 0.17 min, 2. K/min; Tend: 250. C |
Capillary | Supelcowax-10 | 1727. | Cavaleiro, Salgueiro, et al., 2004 | 30. m/0.2 mm/0.2 μm, He, 3. K/min, 220. C @ 15. min; Tstart: 70. C |
Capillary | RTX-Wax | 1717. | Cavalli, Tomi, et al., 2003 | 60. m/0.22 mm/0.25 μm, He, 2. K/min, 230. C @ 45. min; Tstart: 60. C |
Capillary | Innowax | 1736. | Chisholm, Jell, et al., 2003 | 15. m/0.25 mm/0.25 μm, He, 35. C @ 5. min, 4. K/min, 225. C @ 20. min |
Capillary | AT-Wax | 1711. | Pino, Almora, et al., 2003 | 60. m/0.32 mm/0.25 μm, He, 65. C @ 10. min, 2. K/min, 250. C @ 60. min |
Capillary | AT-Wax | 1711. | Pino and Marbot, 2001 | 60. m/0.32 mm/0.25 μm, He, 65. C @ 10. min, 2. K/min, 250. C @ 60. min |
Capillary | CP-Wax 52CB | 1714. | Verzera, Campisi, et al., 2001 | 60. m/0.25 mm/0.25 μm, He, 45. C @ 0.17 min, 2. K/min; Tend: 250. C |
Capillary | DB-Wax | 1725. | Kim, Thuy, et al., 2000 | 30. m/0.25 mm/0.25 μm, He, 40. C @ 5. min, 2. K/min, 200. C @ 20. min |
Capillary | DB-Wax | 1718. | Kim, Thuy, et al., 2000 | 30. m/0.25 mm/0.25 μm, He, 40. C @ 5. min, 2. K/min, 200. C @ 20. min |
Capillary | CP-Wax 52CB | 1718. | Chevance and Farmer, 1999 | 40. C @ 5. min, 4. K/min, 220. C @ 30. min; Column length: 50. m; Column diameter: 0.32 mm |
Capillary | DB-Wax | 1735. | Brophy, Goldsack, et al., 1998 | He, 3. K/min; Column length: 60. m; Column diameter: 0.32 mm; Tstart: 35. C; Tend: 220. C |
Capillary | SP-1000 | 1737. | Brophy, Goldsack, et al., 1997 | He, 3. K/min; Column length: 85. m; Column diameter: 0.5 mm; Tstart: 65. C; Tend: 225. C |
Capillary | BP-20 | 1733. | Mariotti, Tomi, et al., 1997 | 50. m/0.22 mm/0.25 μm, He, 2. K/min, 230. C @ 35. min; Tstart: 60. C |
Capillary | DB-Wax | 1705. | Sagrero-Nieves, Bartley, et al., 1997 | 60. m/0.32 mm/0.5 μm, He, 2. K/min, 225. C @ 20. min; Tstart: 50. C |
Capillary | Carbowax 20M | 1721. | Mondello, Dugo, et al., 1995 | 60. m/0.32 mm/0.425 μm, He, 45. C @ 3. min, 3. K/min, 300. C @ 20. min |

Van Den Dool and Kratz RI, polar column, custom temperature program

Column type | Active phase | I | Reference | Comment |
---|---|---|---|---|
Capillary | CP-Wax 52CB | 1739. | Romeo, Ziino, et al., 2007 | 60. m/0.25 mm/0.25 μm, He; Program: 45C(5min) => 10C/min => 80C => 2C/min => 240C |

Normal alkane RI, non-polar column, temperature ramp

Column type | Active phase | I | Reference | Comment |
---|---|---|---|---|
Capillary | HP-5 MS | 1212. | Sardashti, Valizadeh, et al., 2013 | 60. m/0.25 mm/0.25 μm, Helium, 40. C @ 1. min, 3. K/min, 250. C @ 20. min |
Capillary | RTX-1 | 1214. | Bendiabdellah, El Amine Dib, et al., 2012 | 60. m/0.22 mm/0.25 μm, Helium, 2. K/min, 230. C @ 5. min; Tstart: 60. C |
Capillary | RTX-1 | 1214. | Bendiabdellah, El Amine Dib, et al., 2012 | 60. m/0.22 mm/0.25 μm, Helium, 2. K/min, 230. C @ 5. min; Tstart: 60. C |
Capillary | HP-5 MS | 1284. | Sandoval-Montemayor, Garcia, et al., 2012 | 25. m/0.20 mm/0.30 μm, Helium, 40. C @ 2. min, 10. K/min, 260. C @ 20. min |
Capillary | HP-5 MS | 1240. | Zouari, Ayadi, et al., 2012 | 30. m/0.25 mm/0.25 μm, Helium, 50. C @ 1. min, 7. K/min, 250. C @ 5. min |
Capillary | HP-5 | 1243. | Bertoli, Lepnardi, et al., 2011 | 30. m/0.25 mm/0.25 μm, Helium, 3. K/min; Tstart: 60. C; Tend: 240. C |
Capillary | DB-5 MS | 1242. | Cui, Yang, et al., 2011 | 30. m/0.25 mm/0.25 μm, Helium, 3. K/min; Tstart: 60. C; Tend: 270. C |
Capillary | VF-5 MS | 1247. | Leffingwell and Alford, 2011 | 60. m/0.32 mm/0.25 μm, Helium, 2. K/min, 260. C @ 28. min; Tstart: 30. C |
Capillary | VF-5 MS | 1249. | Leffingwell and Alford, 2011 | 60. m/0.32 mm/0.25 μm, Helium, 2. K/min, 260. C @ 28. min; Tstart: 30. C |
Capillary | DB-1 | 1218. | Misharina T., 2011 | 50. m/0.32 mm/0.25 μm, Helium, 8. K/min; Tstart: 60. C; Tend: 250. C |
Capillary | CP-Sil 5 CB | 1220. | Mothana, Hasson, et al., 2011 | 30. m/0.25 mm/0.26 μm, Nitrogen, 3. K/min, 280. C @ 22. min; Tstart: 45. C |
Capillary | ZB-5 | 1198. | Vazques, Aimar, et al., 2011 | 30. m/0.25 mm/0.25 μm, Nitrogen, 40. C @ 5. min, 5. K/min; Tend: 200. C |
Capillary | ZB-5 | 1202. | Vazquez, Demmel, et al., 2011 | 30. m/0.25 mm/0.25 μm, Nitrogen, 40. C @ 5. min, 5. K/min, 200. C @ 5. min |
Capillary | DB-5 MS | 1249. | Mesa-Arango, Betancur-Galvis, et al., 2010 | 60. m/0.25 mm/0.25 μm, Helium, 40. C @ 15. min, 5. K/min, 250. C @ 15. min |
Capillary | HP-5 MS | 1249. | Radulovic, Blagojevic, et al., 2010 | 30. m/0.25 mm/0.25 μm, Helium, 5. K/min, 290. C @ 10. min; Tstart: 70. C |
Capillary | HP-5 MS | 1247. | Radulovic, Dordevic, et al., 2010 | 30. m/0.25 mm/0.25 μm, Helium, 5. K/min, 290. C @ 10. min; Tstart: 70. C |
Capillary | DB-5 | 1224. | Yang, Zhang, et al., 2010 | 30. m/0.25 mm/0.25 μm, Helium, 40. C @ 1. min, 10. K/min, 250. C @ 3. min |
Capillary | OV-101 | 1228. | Benites, Moiteiro, et al., 2009 | 50. m/0.25 mm/0.25 μm, Helium, 2. K/min; Tstart: 70. C; Tend: 220. C |
Capillary | SE-54 | 1240. | Dayisoylu and Alma, 2009 | 30. m/0.25 mm/0.25 μm, Helium, 60. C @ 5. min, 2. K/min, 260. C @ 999. min |
Capillary | DB-5 | 1257. | Lawal and Oyedelji, 2009 | 30. m/0.25 mm/0.25 μm, Helium, 5. K/min; Tstart: 70. C; Tend: 240. C |
Capillary | HP-5 | 1241. | Maridass, 2009 | 25. m/0.20 mm/0.33 μm, Helium, 3. K/min, 240. C @ 7. min; Tstart: 60. C |
Capillary | 5 % Phenyl methyl siloxane | 1244. | Retta, Gattuso, et al., 2009 | 60. m/0.25 mm/0.25 μm, Helium, 3. K/min, 225. C @ 3. min; Tstart: 90. C |
Capillary | DB-5 | 1246. | Scrivanti, Anton, et al., 2009 | 30. m/0.25 mm/0.25 μm, Nitrogen, 2. K/min; Tstart: 40. C; Tend: 230. C |
Capillary | DB-1 MS | 1214. | Seo, Kim, et al., 2009 | 30. m/0.25 mm/0.25 μm, Helium, 40. C @ 1. min, 6. K/min, 250. C @ 4. min |
Capillary | DB-5 MS | 1254. | Su, Wang, et al., 2009 | 30. m/0.25 mm/0.25 μm, Helium, 40. C @ 2. min, 4. K/min, 250. C @ 2. min |
Capillary | HP-5 MS | 1246. | Zhao, Zeng, et al., 2009 | 30. m/0.25 mm/0.25 μm, Helium, 4. K/min; Tstart: 50. C; Tend: 280. C |
Capillary | HP-5 | 1245. | Aicha, Ines, et al., 2008 | 30. m/0.25 mm/0.25 μm, Helium, 50. C @ 3. min, 9. K/min, 280. C @ 3. min |
Capillary | HP-5 | 1244. | Flamini, Tebano, et al., 2008 | 30. m/0.25 mm/0.25 μm, N2, 60. C @ 10. min, 5. K/min; Tend: 220. C |
Capillary | SLB-5 MS | 1244. | Lo Presti, Sciarrone, et al., 2008 | 30. m/0.25 mm/0.25 μm, Helium, 50. C @ 2. min, 3. K/min, 250. C @ 10. min |
Capillary | DB-5 MS | 1239. | Noudogbessi, Yedomonhan, et al., 2008 | 30. m/0.25 mm/0.25 μm, Helium, 50. C @ 5. min, 5. K/min, 300. C @ 5. min |
Capillary | Elite-1 | 1240. | Raj, Baby, et al., 2008 | 30. m/0.32 mm/0.25 μm, Helium, 3. K/min; Tstart: 60. C; Tend: 246. C |
Capillary | HP-5 MS | 1236. | Sahraoui, Vian, et al., 2008 | 30. m/0.25 mm/0.25 μm, Helium, 60. C @ 8. min, 2. K/min, 250. C @ 15. min |
Capillary | HP-5 MS | 1250. | Sarikurkcu, Tepe, et al., 2008 | 30. m/0.25 mm/0.25 μm, Helium, 3. K/min; Tstart: 50. C; Tend: 240. C |
Capillary | OV-1 | 1228. | Wang, Yi, et al., 2008 | 30. m/0.25 mm/0.25 μm, Helium, 6. K/min; Tstart: 65. C; Tend: 260. C |
Capillary | HP-5 MS | 1242. | Adams, Beauchamp, et al., 2007 | 30. m/0.25 mm/0.25 μm, Helium, 50. C @ 10. min, 3. K/min, 230. C @ 10. min |
Capillary | DB-5 | 1242. | Amiri, 2007 | 50. m/0.20 mm/0.32 μm, Nitrogen, 60. C @ 3. min, 5. K/min, 220. C @ 5. min |
Capillary | CP Sil 5 CB | 1218. | Baran, von Reuss, et al., 2007 | 30. m/0.32 mm/0.25 μm, N2, 4. K/min; Tstart: 60. C; Tend: 300. C |
Capillary | HP-5MS | 1269. | Ferhat, Meklati, et al., 2007 | 30. m/0.25 mm/0.25 μm, He, 60. C @ 8. min, 2. K/min, 250. C @ 15. min |
Capillary | HP-5MS | 1242. | Ferhat, Tigrine-Kordjani, et al., 2007 | 30. m/0.25 mm/0.25 μm, He, 60. C @ 8. min, 2. K/min, 250. C @ 15. min |
Capillary | DBP-5 | 1215. | Heravi and Sereshti, 2007 | 25. m/0.25 mm/0.22 μm, Helium, 40. C @ 1. min, 3. K/min, 250. C @ 10. min |
Capillary | CP Sil 5 CB | 1230. | Hnawia, Cabalion, et al., 2007 | 30. m/0.25 mm/0.25 μm, N2, 5. K/min; Tstart: 50. C; Tend: 200. C |
Capillary | SE-30 | 1242. | Loizzo, Tundis, et al., 2007 | 30. m/0.25 mm/0.25 μm, He, 40. C @ 5. min, 5. K/min, 250. C @ 10. min |
Capillary | HP-5 | 1241. | Loizzo, Tundis, et al., 2007 | 30. m/0.25 mm/0.25 μm, He, 40. C @ 5. min, 5. K/min, 250. C @ 10. min |
Capillary | Methyl Silicone | 1243. | Ozcan and Chalchat, 2007 | Helium, 3. K/min; Column length: 50. m; Column diameter: 0.25 mm; Tstart: 50. C; Tend: 240. C |
Capillary | HP-5 | 1243. | Pavlovic, Petrovic, et al., 2007 | 25. m/0.32 mm/0.52 μm, Helium, 4. K/min; Tstart: 40. C; Tend: 280. C |
Capillary | HP-5 | 1240. | Ristic, Krivokuca-Dokic, et al., 2007 | 30. m/0.25 mm/0.25 μm, Helium, 4. K/min; Tstart: 40. C; Tend: 260. C |
Capillary | DB-5 | 1193. | Sefidkon, Abbasi, et al., 2007 | 30. m/0.25 mm/0.25 μm, He, 4. K/min; Tstart: 50. C; Tend: 240. C |
Capillary | DBP-5 | 1215. | Sereshti and Samadi, 2007 | 25. m/0.25 mm/0.22 μm, Helium, 40. C @ 1. min, 3. K/min, 250. C @ 10. min |
Capillary | DB-5 | 1232. | Tiwary, Nail, et al., 2007 | Helium, 2. K/min, 200. C @ 20. min; Column length: 30. m; Column diameter: 0.25 mm; Tstart: 60. C |
Capillary | DB-5 | 1242. | Tiwary, Nail, et al., 2007 | Helium, 2. K/min, 200. C @ 20. min; Column length: 30. m; Column diameter: 0.25 mm; Tstart: 60. C |
Capillary | HP-5 MS | 1243. | Vagionas, Graikou, et al., 2007 | 30. m/0.25 mm/0.25 μm, Helium, 3. K/min; Tstart: 60. C; Tend: 280. C |
Capillary | HP-5MS | 1279. | Vichi, Riu-Aumatell, et al., 2007 | 30. m/0.25 mm/0.25 μm, He, 40. C @ 5. min, 3. K/min, 250. C @ 10. min |
Capillary | HP-5 | 1251. | Wenguang, Wenlai, et al., 2007 | 30. m/0.25 mm/0.25 μm, 40. C @ 3. min, 5. K/min, 240. C @ 10. min |
Capillary | HP-5 | 1195. | Abdelwahed, Hayder, et al., 2006 | 30. m/0.25 mm/0.25 μm, N2, 50. C @ 3. min, 9. K/min, 280. C @ 3. min |
Capillary | HP-5 | 1203. | Abdelwahed, Hayder, et al., 2006 | 30. m/0.25 mm/0.25 μm, N2, 50. C @ 3. min, 9. K/min, 280. C @ 3. min |
Capillary | DB-5 | 1240. | Askari and Sefidkon, 2006 | 30. m/0.25 mm/0.25 μm, He, 40. C @ 5. min, 4. K/min; Tend: 260. C |
Capillary | ZB-5 | 1193. | Biondi, Sari, et al., 2006 | 30. m/0.25 mm/0.25 μm, 2. K/min; Tstart: 40. C; Tend: 300. C |
Capillary | BP-1 | 1213. | Boti, Muselli, et al., 2006 | 50. m/0.22 mm/0.25 μm, He, 2. K/min, 220. C @ 20. min; Tstart: 60. C |
Capillary | HP-5 | 1242. | Coronel, Cerda-Garcia-Rojas, et al., 2006 | 30. m/0.32 mm/0.25 μm, He, 3. K/min; Tstart: 60. C; Tend: 246. C |
Capillary | HP-1 | 1212. | Filippi, Lanfranchi, et al., 2006 | 50. m/0.2 mm/0.33 μm, He, 2. K/min, 250. C @ 40. min; Tstart: 60. C |
Capillary | DB-5 | 1246. | Javidnia, Miri, et al., 2006 | 30. m/0.25 mm/0.25 μm, Helium, 3. K/min; Tstart: 60. C; Tend: 260. C |
Capillary | HP-5 | 1243. | Kucuk, Gulec, et al., 2006 | 30. m/0.32 mm/0.25 μm, Helium, 60. C @ 2. min, 5. K/min, 260. C @ 13. min |
Capillary | CP Sil 5 CB | 1220. | Lis and Milczarek, 2006 | 30. m/0.32 mm/0.25 μm, N2, 4. K/min; Tstart: 50. C; Tend: 300. C |
Capillary | CP Sil 5 CB | 1223. | Martin, Joseph, et al., 2006 | 30. m/0.25 mm/0.25 μm, N2, 5. K/min; Tstart: 50. C; Tend: 200. C |
Capillary | HP-5 MS | 1242. | Marzouk, Mansour, et al., 2006 | 30. m/0.25 mm/0.25 μm, Nitrogen, 5. K/min, 280. C @ 5. min; Tstart: 50. C |
Capillary | HP-5 | 1242. | Marzouk, Neffati, et al., 2006 | 30. m/0.25 mm/0.52 μm, N2, 5. K/min, 280. C @ 5. min; Tstart: 50. C |
Capillary | DB-5 | 1195. | Morteza-Semnani, Akbarzadeh, et al., 2006 | 30. m/0.25 mm/0.25 μm, He, 4. K/min; Tstart: 60. C; Tend: 220. C |
Capillary | DB-5 | 1196. | Morteza-Semnani, Saeedi, et al., 2006 | 30. m/0.25 mm/0.25 μm, He, 60. C @ 4. min, 4. K/min; Tend: 260. C |
Capillary | DB-5 | 1245. | Morteza-Semnani K., Saeedi M., et al., 2006 | 30. m/0.25 mm/0.25 μm, He, 60. C @ 5. min, 4. K/min; Tend: 220. C |
Capillary | NB-30 | 1222. | Orav, Raal, et al., 2006 | 30. m/0.2 mm/0.25 μm, He, 2. K/min; Tstart: 50. C; Tend: 250. C |
Capillary | DB-5 | 1241. | Sefidkon and Jamzad, 2006 | 30. m/0.25 mm/0.25 μm, He, 4. K/min; Tstart: 40. C; Tend: 240. C |
Capillary | SPB-5 | 1242. | Stojanovic, Palic, et al., 2006 | He, 50. C @ 3. min, 5. K/min, 250. C @ 15. min |
Capillary | DB-5 | 1214. | Yadegarinia, Gachkar, et al., 2006 | 30. m/0.25 mm/0.25 μm, He, 4. K/min; Tstart: 40. C; Tend: 250. C |
Capillary | DB-5 | 1246. | Chagonda and Chalchat, 2005 | 50. m/0.3 mm/0.25 μm, 2. K/min; Tstart: 60. C; Tend: 240. C |
Capillary | DB-5 | 1243. | Chagonda and Chalchat, 2005, 2 | 25. m/0.25 mm/0.15 μm, 40. C @ 5. min, 3. K/min; Tend: 220. C |
Capillary | Methyl Silicone | 1243. | Chalchat and Özcan, 2005 | He, 3. K/min; Column length: 60. m; Column diameter: 0.3 mm; Tstart: 50. C; Tend: 240. C |
Capillary | HP-5 | 1240. | Duarte, Figueira, et al., 2005 | 25. m/0.2 mm/0.33 μm, He, 3. K/min, 240. C @ 7. min; Tstart: 60. C |
Capillary | DB-1 | 1223. | Fakhari, Salehi, et al., 2005 | 60. m/0.25 mm/0.25 μm, He, 5. K/min; Tstart: 60. C; Tend: 250. C |
Capillary | HP-5 | 1265. | Figuérédo, Cabassu, et al., 2005 | 30. m/0.25 mm/0.25 μm, He, 50. C @ 5. min, 5. K/min, 300. C @ 5. min |
Capillary | HP-5 | 1205. | Figuérédo, Cabassu, et al., 2005 | 30. m/0.25 mm/0.25 μm, He, 50. C @ 5. min, 5. K/min, 300. C @ 5. min |
Capillary | RSL-200 | 1231. | Jirovetz, Buchbauer, et al., 2005 | 30. m/0.25 mm/0.25 μm, 40. C @ 2. min, 6. K/min, 280. C @ 10. min |
Capillary | DB-1 | 1206. | Khalighi-Sigaroodi, Hadijiakhoondi, et al., 2005 | 30. m/0.25 mm/0.25 μm, He, 50. C @ 1. min, 2.5 K/min, 265. C @ 30. min |
Capillary | DB-5 | 1244. | Khayyat and Karimi, 2005 | He, 3. K/min; Column length: 30. m; Column diameter: 0.32 mm; Tstart: 60. C; Tend: 240. C |
Capillary | HP-5 | 1250.5 | Leffingwell and Alford, 2005 | 60. m/0.32 mm/0.25 μm, He, 30. C @ 2. min, 2. K/min, 260. C @ 28. min |
Capillary | DB-5 | 1243. | Morteza-Semnani, Akbarzadeh, et al., 2005 | 30. m/0.25 mm/0.25 μm, He, 60. C @ 5. min, 4. K/min; Tend: 220. C |
Capillary | DB-5 | 1254. | Özel, Gögüs, et al., 2005 | 30. m/0.32 mm/0.25 μm, He, 40. C @ 0.5 min, 5. K/min, 250. C @ 2. min |
Capillary | HP-5 | 1242. | Saeidnia, Gohari, et al., 2005 | He, 5. K/min; Column length: 30. m; Column diameter: 0.25 mm; Tstart: 60. C; Tend: 240. C |
Capillary | HP-5MS | 1248. | Sajjadi and Ghannadi, 2005 | 30. m/0.25 mm/0.25 μm, He, 4. K/min; Tstart: 60. C; Tend: 275. C |
Capillary | DB-1 | 1246. | Salehi, Sonboli, et al., 2005 | 60. m/0.25 mm/0.25 μm, He, 5. K/min, 250. C @ 10. min; Tstart: 60. C |
Capillary | DB-5 | 1241. | Sefidkon and Jamzad, 2005 | He, 4. K/min; Column length: 30. m; Column diameter: 0.25 mm; Tstart: 40. C; Tend: 240. C |
Capillary | HP-5MS | 1198. | Shams-Ardakani, Ghannadi, et al., 2005 | 30. m/0.25 mm/0.25 μm, He, 15. K/min; Tstart: 60. C; Tend: 275. C |
Capillary | DB-5MS | 1242. | da Silva, Andrade, et al., 2005 | 30. m/0.25 mm/0.25 μm, He, 3. K/min; Tstart: 60. C; Tend: 240. C |
Capillary | PE-5 | 1259. | Singh, Raina, et al., 2005 | 30. m/0.32 mm/0.25 μm, H2, 60. C @ 2. min, 5. K/min, 230. C @ 4. min |
Capillary | DB-5 | 1193. | Skoula and Grayer, 2005 | 30. m/0.25 mm/0.25 μm, He, 3. K/min, 230. C @ 20. min; Tstart: 60. C |
Capillary | HP-5MS | 1244. | Slavkovska, Couladis, et al., 2005 | 30. m/0.25 mm/0.25 μm, He, 3. K/min; Tstart: 60. C; Tend: 280. C |
Capillary | DB-1 | 1219. | Sonboli, Salehi, et al., 2005 | 60. m/0.25 mm/0.25 μm, He, 5. K/min, 250. C @ 10. min; Tstart: 60. C |
Capillary | BP-1 | 1227. | Srivastava, Srivastava, et al., 2005 | 30. m/0.32 mm/0.25 μm, N2, 5. K/min, 220. C @ 15. min; Tstart: 60. C |
Capillary | HP-5MS | 1225. | Tepe B., Sokmen M., et al., 2005 | 30. m/0.25 mm/0.25 μm, He, 50. C @ 3. min, 3. K/min; Tend: 240. C |
Capillary | DB-5 | 1223. | Tzakou and Constantinidis, 2005 | 30. m/0.32 mm/0.25 μm, He, 3. K/min; Tstart: 60. C; Tend: 280. C |
Capillary | HP-5 | 1237. | Aghel, Yamini, et al., 2004 | 30. m/0.25 mm/0.32 μm, He, 60. C @ 3. min, 5. K/min; Tend: 250. C |
Capillary | CP Sil 5 CB | 1231. | Agnaniet, Menut, et al., 2004 | 30. m/0.25 mm/0.25 μm, N2, 5. K/min; Tstart: 50. C; Tend: 200. C |
Capillary | BP-1 | 1215. | Blanc, Muselli, et al., 2004 | 50. m/0.22 mm/0.25 μm, 2. K/min, 220. C @ 20. min; Tstart: 60. C |
Capillary | DB-5 | 1193. | Kalvandi, Sefidkon, et al., 2004 | 60. m/0.25 mm/0.25 μm, He, 40. C @ 4. min, 4. K/min; Tend: 280. C |
Capillary | RTX-1 | 1218. | Kalemba and Thiem, 2004 | 30. m/0.25 mm/0.25 μm, N2, 4. K/min; Tstart: 60. C; Tend: 300. C |
Capillary | DB-1 | 1208. | Park, Lee, et al., 2004 | 60. m/0.32 mm/0.25 μm, He, 35. C @ 4. min, 2. K/min, 230. C @ 25. min |
Capillary | DB-1 | 1209. | Park, Lee, et al., 2004 | 60. m/0.32 mm/0.25 μm, He, 35. C @ 4. min, 2. K/min, 230. C @ 25. min |
Capillary | DB-1 | 1209. | Park, Lee, et al., 2004 | 60. m/0.32 mm/0.25 μm, He, 35. C @ 4. min, 2. K/min, 230. C @ 25. min |
Capillary | DB-1 | 1213. | Park, Lee, et al., 2004 | 60. m/0.32 mm/0.25 μm, He, 35. C @ 4. min, 2. K/min, 230. C @ 25. min |
Capillary | NB-30 | 1220. | Raal, Arak, et al., 2004 | 50. m/0.2 mm/0.25 μm, He, 2. K/min; Tstart: 50. C; Tend: 250. C |
Capillary | DB-1 | 1222. | Sawamura, Son, et al., 2004 | 60. m/0.25 mm/0.25 μm, 70. C @ 2. min, 2. K/min, 230. C @ 20. min |
Capillary | DB-1 | 1222. | Sawamura, Sou, et al., 2004 | 60. m/0.25 mm/0.25 μm, Nitrogen, 70. C @ 2. min, 2. K/min; Tend: 230. C |
Capillary | DB-5 | 1200. | Sefidkon, Jamzad, et al., 2004 | 30. m/0.25 mm/0.25 μm, 50. C @ 5. min, 3. K/min; Tend: 250. C |
Capillary | HP-5 | 1250. | Shafi, Nambiar, et al., 2004 | 25. m/0.2 mm/0.5 μm, N2, 3. K/min; Tstart: 30. C; Tend: 280. C |
Capillary | HP-5 | 1242. | Simic, Sokovic, et al., 2004 | 25. m/0.32 mm/0.52 μm, H2, 4. K/min; Tstart: 40. C; Tend: 240. C |
Capillary | DB-5 | 1240. | Tellez, Khan, et al., 2004 | 30. m/0.25 mm/0.25 μm, He, 3. K/min; Tstart: 60. C; Tend: 240. C |
Capillary | DB-5 | 1193. | Tellez, Khan, et al., 2004 | 30. m/0.25 mm/0.25 μm, He, 3. K/min; Tstart: 60. C; Tend: 240. C |
Capillary | BPX-5 | 1276. | Vilaseca, Guy, et al., 2004 | 25. m/0.22 mm/1. μm, He, 60. C @ 5. min, 3. K/min, 250. C @ 10. min |
Capillary | DB-5 | 1242. | Cabanillas, Lopez, et al., 2003 | 30. m/0.25 mm/0.25 μm, He, 4. K/min; Tstart: 60. C; Tend: 240. C |
Capillary | DB-1 | 1220. | Choi, 2003 | 60. m/0.25 mm/0.25 μm, He, 70. C @ 2. min, 2. K/min, 230. C @ 20. min |
Capillary | HP-5MS | 1239. | Couladis, Özcan, et al., 2003 | 30. m/0.25 mm/0.25 μm, He, 3. K/min; Tstart: 60. C; Tend: 280. C |
Capillary | DB-5 | 1262. | Edris, Shalaby, et al., 2003 | He, 3. K/min; Column length: 60. m; Column diameter: 0.32 mm; Tstart: 50. C; Tend: 220. C |
Capillary | DB-5 | 1208. | Edris, Shalaby, et al., 2003 | He, 3. K/min; Column length: 60. m; Column diameter: 0.32 mm; Tstart: 50. C; Tend: 220. C |
Capillary | RSL-200 | 1195. | Jirovetz, Buchbauer, et al., 2003 | 30. m/0.25 mm/0.25 μm, H2, 40. C @ 2. min, 6. K/min, 280. C @ 10. min |
Capillary | RSL-200 | 1228. | Jirovetz, Buchbauer, et al., 2003, 2 | 30. m/0.32 mm/0.25 μm, H2, 40. C @ 5. min, 6. K/min, 280. C @ 5. min |
Capillary | CP Sil 5 CB | 1218. | Khanavi, Hadjiakhoondi, et al., 2003 | 25. m/0.25 mm/0.39 μm, He, 5. K/min; Tstart: 60. C; Tend: 220. C |
Capillary | HP-5 | 1241. | Mookdasanit, Tamura, et al., 2003 | Helium, 2. K/min, 210. C @ 60. min; Column length: 30. m; Column diameter: 0.32 mm; Tstart: 70. C |
Capillary | HP-5 | 1197. | Mookdasanit, Tamura, et al., 2003 | Helium, 2. K/min, 210. C @ 60. min; Column length: 30. m; Column diameter: 0.32 mm; Tstart: 70. C |
Capillary | OV-101 | 1215. | Orav, Kailas, et al., 2003 | 50. m/0.2 mm/0.5 μm, He, 2. K/min; Tstart: 50. C; Tend: 250. C |
Capillary | DB-5 | 1243. | Pino, Marbot, et al., 2003 | 30. m/0.25 mm/0.25 μm, H2, 60. C @ 10. min, 4. K/min, 280. C @ 40. min |
Capillary | HP-5 | 1229. | Pitarokili, Tzakou, et al., 2003 | 30. m/0.25 mm/0.25 μm, He, 3. K/min; Tstart: 60. C; Tend: 280. C |
Capillary | NB-30 | 1220. | Raal, Arak, et al., 2003 | 50. m/0.2 mm/0.5 μm, He, 2. K/min; Tstart: 50. C; Tend: 250. C |
Capillary | HP-5 | 1245. | Stashenko, Jaramillo, et al., 2003 | 60. m/0.25 mm/0.25 μm, 40. C @ 15. min, 5. K/min; Tend: 250. C |
Capillary | DB-1 | 1236. | Tu, Onishi, et al., 2003 | 60. m/0.25 mm/0.25 μm, N2, 70. C @ 2. min, 2. K/min, 230. C @ 20. min |
Capillary | HP-5 | 1241. | Velickovic, Ristic, et al., 2003 | 25. m/0.32 mm/0.53 μm, Helium, 4. K/min; Tstart: 40. C; Tend: 280. C |
Capillary | HP-5 | 1242. | Velickovic, Ristic, et al., 2003 | 25. m/0.32 mm/0.53 μm, Helium, 4. K/min; Tstart: 40. C; Tend: 280. C |
Capillary | HP-5 | 1243. | Velickovic, Ristic, et al., 2003 | 25. m/0.32 mm/0.53 μm, Helium, 4. K/min; Tstart: 40. C; Tend: 280. C |
Capillary | DB-5 | 1243. | Zoghbi, Andrade, et al., 2003 | 30. m/0.25 mm/0.25 μm, He, 3. K/min; Tstart: 60. C; Tend: 240. C |
Capillary | DB-5 | 1242. | Farah, Fechtal, et al., 2002 | 30. m/0.25 mm/0.25 μm, N2, 4. K/min; Tstart: 50. C; Tend: 250. C |
Capillary | HP-5 | 1243. | Farah, Fechtal. M., et al., 2002 | 30. m/0.25 mm/0.25 μm, N2, 50. C @ 5. min, 4. K/min; Tend: 250. C |
Capillary | HP-5 | 1240. | Ghannadi, Sajjadi, et al., 2002 | 30. m/0.25 mm/0.25 μm, He, 4. K/min; Tstart: 60. C; Tend: 275. C |
Capillary | RSL-200 | 1231. | Jirovetz, Buchbauer, et al., 2002 | 30. m/0.32 mm/0.25 μm, H2, 40. C @ 5. min, 6. K/min, 280. C @ 5. min |
Capillary | RSL-200 | 1231. | Jirovetz, Smith, et al., 2002 | 30. m/0.25 mm/0.25 μm, H2, 40. C @ 2. min, 6. K/min, 280. C @ 10. min |
Capillary | SPB-5 | 1256. | Kim and Lee, 2002 | 60. m/0.25 mm/0.25 μm, He, 50. C @ 3. min, 5. K/min, 240. C @ 10. min |
Capillary | HP-5 | 1237. | Lockwood, Asghari, et al., 2002 | 30. m/0.25 mm/0.25 μm, 60. C @ 4. min, 4. K/min; Tend: 275. C |
Capillary | DB-5 | 1233. | Mahmout, Bessière, et al., 2002 | 25. m/0.23 mm/0.15 μm, N2, 3. K/min; Tstart: 50. C; Tend: 250. C |
Capillary | DB-5MS | 1243. | Maia, Zoghbi, et al., 2002 | 30. m/0.25 mm/0.25 μm, He, 3. K/min; Tstart: 60. C; Tend: 240. C |
Capillary | CP Sil 5 CB | 1218. | Monfared, Davarani, et al., 2002 | He, 5. K/min; Column length: 25. m; Column diameter: 0.25 mm; Tstart: 60. C; Tend: 220. C |
Capillary | HP-5 | 1253. | Novak, Langbehn, et al., 2002 | 30. m/0.25 mm/0.25 μm, 3. K/min; Tstart: 60. C; Tend: 240. C |
Capillary | HP-5 | 1202. | Novak, Langbehn, et al., 2002 | 30. m/0.25 mm/0.25 μm, 3. K/min; Tstart: 60. C; Tend: 240. C |
Capillary | HP-1 | 1229. | Priestap, van Baren, et al., 2002 | 50. m/0.25 mm/0.25 μm, N2, 3. K/min; Tstart: 90. C; Tend: 220. C |
Capillary | DB-1 | 1212. | Sefidkon, Jalili, et al., 2002 | 60. m/0.25 mm/0.25 μm, He, 40. C @ 5. min, 4. K/min; Tend: 280. C |
Capillary | SE-54 | 1242. | Silva A.D., Patitucci M.L., et al., 2002 | 30. m/0.32 mm/0.25 μm, H2, 5. K/min; Tstart: 40. C; Tend: 240. C |
Capillary | HP-5 | 1245. | Gallori, Flamini, et al., 2001 | 30. m/0.25 mm/0.25 μm, N2, 60. C @ 10. min, 5. K/min; Tend: 220. C |
Capillary | HP-5 | 1195. | Gallori, Flamini, et al., 2001 | 30. m/0.25 mm/0.25 μm, N2, 60. C @ 10. min, 5. K/min; Tend: 220. C |
Capillary | RSL-200 | 1227. | Jirovetz L., Buchbauer G., et al., 2001 | 30. m/0.32 mm/0.25 μm, H2, 40. C @ 5. min, 6. K/min, 280. C @ 5. min |
Capillary | RTX-1 | 1219. | Kalemba, Marschall, et al., 2001 | 30. m/0.25 mm/0.25 μm, N2, 4. K/min; Tstart: 60. C; Tend: 300. C |
Capillary | DB-5MS | 1217. | Marongiu, Porcedda, et al., 2001 | 30. m/0.25 mm/0.25 μm, He, 3. K/min, 240. C @ 30. min; Tstart: 60. C |
Capillary | OV-101 | 1215. | Orav, Kailas, et al., 2001 | 50. m/0.2 mm/0.5 μm, He, 2. K/min; Tstart: 50. C; Tend: 250. C |
Capillary | OV-101 | 1215. | Orav and Kann, 2001 | He, 2. K/min; Column length: 50. m; Column diameter: 0.2 mm; Tstart: 50. C; Tend: 250. C |
Capillary | SPB-1 | 1187. | Vijayanand, Rao, et al., 2001 | 30. m/0.32 mm/0.25 μm, He, 2. K/min; Tstart: 50. C; Tend: 250. C |
Capillary | OV-101 | 1220. | Yang, 2001 | N2, 2. K/min; Column length: 50. m; Column diameter: 0.25 mm; Tstart: 80. C; Tend: 200. C |
Capillary | OV-101 | 1220. | Yang, 2001, 2 | N2, 2. K/min; Column length: 50. m; Column diameter: 0.25 mm; Tstart: 80. C; Tend: 200. C |
Capillary | RSL-200 | 1227. | Jirovetz, Puschmann, et al., 2000 | 60. m/0.32 mm/0.25 μm, H2, 6. K/min; Tstart: 40. C; Tend: 250. C |
Capillary | BP-1 | 1195. | Mohagheghzadeh, Shams-Ardakani, et al., 2000 | 25. m/0.33 mm/1.0 μm, N2, 4. K/min; Tstart: 60. C; Tend: 275. C |
Capillary | HP-5 | 1195. | Mohagheghzadeh, Shams-Ardakani, et al., 2000, 2 | 30. m/0.25 mm/0.25 μm, He, 4. K/min; Tstart: 60. C; Tend: 275. C |
Capillary | DB-5 | 1243. | Tellez, Canel, et al., 1999 | 30. m/0.25 mm/0.25 μm, He, 3. K/min; Tstart: 60. C; Tend: 240. C |
Capillary | SPB-5 | 1245. | Doneanu and Anitescu, 1998 | 50. m/0.32 mm/0.25 μm, He, 3. K/min, 240. C @ 20. min; Tstart: 60. C |
Capillary | OV-1 | 1224. | Kökdil, Kurucu, et al., 1998 | 50. m/0.32 mm/0.25 μm, He, 50. C @ 5. min, 10. K/min, 250. C @ 20. min |
Capillary | HP-1 | 1208. | Ong, Acree, et al., 1998 | 4. K/min; Column length: 25. m; Column diameter: 0.32 mm; Tstart: 35. C; Tend: 250. C |
Capillary | HP-1 | 1228. | Boatright and Crum, 1997 | 30. m/0.25 mm/0.1 μm, He, 50. C @ 2. min, 5. K/min, 300. C @ 3. min |
Capillary | DB-1 | 1206. | Salgueiro, Vila, et al., 1997 | 6. K/min; Tstart: 80. C; Tend: 220. C |
Capillary | DB-5 | 1242. | Tellez, Estell, et al., 1997, 2 | 30. m/0.25 mm/0.25 μm, Helium, 3. K/min; Tstart: 60. C; Tend: 240. C |
Capillary | DB-5 | 1239.4 | Gawdzik, Mardarowicz, et al., 1996 | 30. m/0.25 mm/0.25 μm, 60. C @ 2. min, 4. K/min, 300. C @ 5. min |
Capillary | DB-1 | 1229. | Sagrero-Nieves and Bartley, 1996 | 60. m/0.32 mm/0.50 μm, He, 50. C @ 1. min, 8. K/min, 250. C @ 6. min |
Capillary | HP-5 | 1242. | Collin, Deslauriers, et al., 1993 | 2. K/min; Tstart: 40. C; Tend: 210. C |
Capillary | HP-5 | 1243. | Collin, Deslauriers, et al., 1993 | 2. K/min; Tstart: 40. C; Tend: 210. C |
Capillary | HP-5 | 1191. | Collin, Deslauriers, et al., 1993 | 2. K/min; Tstart: 40. C; Tend: 210. C |
Capillary | HP-5 | 1192. | Collin, Deslauriers, et al., 1993 | 2. K/min; Tstart: 40. C; Tend: 210. C |
Capillary | Methyl Silicone | 1228. | Gopalakrishnan, Menon, et al., 1993 | 50. m/0.25 mm/0.17 μm, N2, 2. K/min; Tstart: 80. C; Tend: 200. C |
Capillary | Methyl Silicone | 1224. | Gopalakrishnan, Menon, et al., 1993 | 50. m/0.25 mm/0.17 μm, N2, 3. K/min; Tstart: 80. C; Tend: 200. C |
Capillary | OV-101 | 1220. | Tamura, Yang, et al., 1993 | 2. K/min; Column length: 50. m; Column diameter: 0.25 mm; Tstart: 80. C; Tend: 200. C |
Capillary | OV-101 | 1224. | Tamura, Yang, et al., 1993 | 2. K/min; Column length: 50. m; Column diameter: 0.25 mm; Tstart: 80. C; Tend: 200. C |
Capillary | OV-101 | 1220. | Zenkevich and Kulikova, 1993 | He, 3. K/min; Column length: 54. m; Column diameter: 0.26 mm; Tstart: 50. C; Tend: 230. C |
Capillary | SE-54 | 1239. | Kollmannsberger, Nitz, et al., 1992 | 30. m/0.25 mm/0.25 μm, Hydrogen, 60. C @ 5. min, 2. K/min, 250. C @ 2. min |
Capillary | RSL-150 | 1216. | Ronse and De Pooter, 1990 | 30. m/0.32 mm/0.20 μm, 3. K/min; Tstart: 30. C; Tend: 200. C |
Capillary | OV-101 | 1220. | Yang and Sugisawa, 1990 | N2, 2. K/min; Column length: 50. m; Column diameter: 0.25 mm; Tstart: 80. C; Tend: 200. C |
Capillary | OV-101 | 1224. | Yang and Sugisawa, 1990 | N2, 2. K/min; Column length: 50. m; Column diameter: 0.25 mm; Tstart: 80. C; Tend: 200. C |
Capillary | OV-101 | 1220. | Sugisawa, Yamamoto, et al., 1989 | N2, 2. K/min; Column length: 50. m; Column diameter: 0.25 mm; Tstart: 80. C; Tend: 200. C |
Capillary | OV-101 | 1218. | Sugisawa, Yang, et al., 1989 | N2, 2. K/min; Column length: 50. m; Column diameter: 0.25 mm; Tstart: 80. C; Tend: 200. C |
Capillary | OV-101 | 1224. | Sugisawa, Yang, et al., 1989 | N2, 2. K/min; Column length: 50. m; Column diameter: 0.25 mm; Tstart: 80. C; Tend: 200. C |
Capillary | BP-1 | 1228. | MacLeod, MacLeod, et al., 1988, 2 | Hydrogen, 70. C @ 5. min, 3. K/min; Column length: 25. m; Column diameter: 0.20 mm; Tend: 180. C |

Normal alkane RI, non-polar column, custom temperature program

Column type | Active phase | I | Reference | Comment |
---|---|---|---|---|
Capillary | DB-1 | 1210. | Albano, Lima, et al., 2012 | 30. m/0.25 mm/0.25 μm, Hydrogen; Program: 45 0C 3 0C/min -> 175 0C 15 0C/min -> 300 0C (10 min) |
Capillary | RTX-1 | 1215. | Bendiabdellah, El Amine Dib, et al., 2012 | 60. m/0.22 mm/0.25 μm, Helium; Program: not specified |
Capillary | RTX-1 | 1215. | Bendiabdellah, El Amine Dib, et al., 2012 | 60. m/0.22 mm/0.25 μm, Helium; Program: not specified |
Capillary | Polydimethyl siloxane with 5 % Ph groups | 1254. | Robinson, Adams, et al., 2012 | Program: not specified |
Capillary | Polydimethyl siloxane with 5 % Ph groups | 1255. | Robinson, Adams, et al., 2012 | Program: not specified |
Capillary | HP-5 MS | 1240. | Sharopov, Sulaimonova, et al., 2012 | 30. m/0.25 mm/0.25 μm, Helium; Program: 40 0C (10 min) 3 0C/min -> 200 0C 2 0C/min -> 220 0C |
Capillary | Siloxane, 5 % Ph | 1260. | VOC BinBase, 2012 | Program: not specified |
Capillary | 1244. | Brandi, Bar, et al., 2011 | Program: not specified | |
Capillary | 5 % Phenyl polydimethyl siloxane | 1244. | Chaverri, Diaz, et al., 2011 | Program: not specified |
Capillary | HP-5 MS | 1242. | Chu, Liu, et al., 2011 | 30. m/0.25 mm/0.25 μm, Helium; Program: 60 0C (1 min) 10 0C -> 180 0C (1 min) 20 0C/min -> 280 0C (15 min) |
Capillary | DB-1 | 1242. | Fathi, Sahari, et al., 2011 | 30. m/0.25 mm/0.25 μm, Helium; Program: 50 0C (5 min) 3 0C/min -> 240 0C 15 0C/min -> 300 0C (3 min) |
Capillary | HP-5 | 1241. | Laribi, Kouki, et al., 2011 | 30. m/0.25 mm/0.25 μm, Nitrogen; Program: 35 0C (10 min) 3 0C/min -> 205 0C 10 0C/min -> 225 0C |
Capillary | DB-5 | 1257. | Miyazaki, Plotto, et al., 2011 | 60. m/0.25 mm/1.00 μm, Helium; Program: 40 0C 4 0C/min -> 230 0C 100 0C/min -> 260 0C (11.7 min) |
Capillary | HP-5 MS | 1243. | Payo, Colo, et al., 2011 | Program: not specified |
Capillary | HP-5 MS | 1243. | Payo, Colo, et al., 2011 | Program: not specified |
Capillary | Polydimethyl siloxane, 5 % phenyl | 1260. | Skogerson, Wohlgemuth, et al., 2011 | Program: not specified |
Capillary | ZB-5 | 1200. | Vazques, Aimar, et al., 2011 | 30. m/0.25 mm/0.25 μm, Nitrogen; Program: not specified |
Capillary | ZB-5 | 1200. | Vazquez, Demmel, et al., 2011 | 30. m/0.25 mm/0.25 μm, Nitrogen; Program: not specified |
Capillary | HP-5 | 1248. | Wang, Liu, et al., 2011 | 30. m/0.25 mm/0.25 μm, Helium; Program: 60 0C (1 min) 10 0C/min -> 180 0C (1 min) 20 0C/min -> 280 0C (15 min) |
Capillary | HP-5 MS | 1242. | Liu, Chu, et al., 2010 | 30. m/0.25 mm/0.25 μm, Helium; Program: 60 0C (1 min) 10 0C/min -> 180 0C (1 min) 20 0C/min -> 280 0C (15 min) |
Capillary | DB-1 | 1224. | Delort and Jaquier, 2009 | 60. m/0.25 mm/0.25 μm, Helium; Program: 50 0C (5 min) 3 0C/min -> 120 0C 5 0C/min -> 250 0C (3 min) 15 0C/min -> 300 0C (20 min) |
Capillary | HP-5 MS | 1271. | Dharmawan, Kasapis, et al., 2009 | 60. m/0.32 mm/1.0 μm, Helium; Program: 120 0C 2 0C/min -> 240 0C 10 0C/min -> 270 0C (2 min) |
Capillary | RTX-5 MS | 1242. | Mebazaa, Mahmoudi, et al., 2009 | 30. m/0.25 mm/0.25 μm, Helium; Program: 50 0C (5 min) 2 0C/min -> 100 0C (5 min) 5 0C/min -> 300 0C |
Capillary | RTX-5 MS | 1249. | Mebazaa, Mahmoudi, et al., 2009 | 30. m/0.25 mm/0.25 μm, Helium; Program: not specified |
Capillary | DB-1 | 1206. | Mendes, Trindade, et al., 2009 | 30. m/0.25 mm/0.25 μm, Hydrogen; Program: 45 0C 3 0C/min -> 175 0C 15 0C/min -> 300 0C (10 min) |
Capillary | HP-5 | 1241. | Riahi, Pourbasheer, et al., 2009 | Column length: 30. m; Column diameter: 0.32 mm; Program: not specified |
Capillary | HP-5 | 1197. | Riahi, Pourbasheer, et al., 2009 | Column length: 30. m; Column diameter: 0.32 mm; Program: not specified |
Capillary | DB-5 MS | 1254. | Su, Wang, et al., 2009 | 30. m/0.25 mm/0.25 μm, Helium; Program: not specified |
Capillary | SLB-5 MS | 1246. | Costa, De Fina, et al., 2008 | 30. m/0.25 mm/0.25 μm, Helium; Program: 50 0C 3 0C/min -> 250 0C (1 min) 10 0C/min -> 300 0C (5 min) |
Capillary | SLB-5 MS | 1239. | Costa, De Fina, et al., 2008 | 30. m/0.25 mm/0.25 μm, Helium; Program: not specified |
Capillary | SPB-5 | 1241. | Kilani, Ledauphin, et al., 2008 | Program: not specified |
Capillary | SPB-5 | 1259. | Kilani, Ledauphin, et al., 2008 | Program: not specified |
Capillary | SPB-5 | 1220. | Kilani, Ledauphin, et al., 2008 | Program: not specified |
Capillary | SPB-5 | 1235. | Kilani, Ledauphin, et al., 2008 | Program: not specified |
Capillary | SLB-5 MS | 1246. | Lo Presti, Sciarrone, et al., 2008 | 30. m/0.25 mm/0.25 μm, Helium; Program: not specified |
Capillary | HP-5MS | 1230. | Ning, Zheng, et al., 2008 | 30. m/0.25 mm/0.25 μm, He; Program: 40 0C (2 min) 3 0C/min -> 180 0C (2 min) 15 0C -> 280 0C |
Capillary | HP-5 | 1247. | Qiao, Xie, et al., 2008 | 30. m/0.25 mm/0.25 μm, Helium; Program: 40 0C (3 min) 3 0C/min -> 160 0C (2 min) 8 0C/min -> 220 0C (3 min) |
Capillary | HP-5 | 1256. | Qiao, Xie, et al., 2008 | 30. m/0.25 mm/0.25 μm, Helium; Program: not specified |
Capillary | Elite-1 | 1243. | Raj, Baby, et al., 2008 | 30. m/0.32 mm/0.25 μm, Helium; Program: not specified |
Capillary | HP-5MS | 1241. | Cole, Haber, et al., 2007 | 30. m/0.25 mm/0.25 μm, He; Program: 40C(10min) => 3C/min => 200C => 2C/min => 220C |
Capillary | HP-5 MS | 1244. | Formisano, Rigano, et al., 2007 | 30. m/0.25 mm/0.25 μm, Helium; Program: 40 0C (5 min) 2 0C/min -> 250 0C (15 min) 10 0C/min -> 270 0C |
Capillary | DB-1 | 1206. | Kamatou, Viljoen, et al., 2007 | 30. m/0.25 mm/0.25 μm, H2; Program: 45 0C 3 0C/min -> 175 0C 15 0C/min -> 300 0C (10 min) |
Capillary | DB-5 | 1243. | Nivinsliene, Butkiene, et al., 2007 | 50. m/0.32 mm/0.25 μm, Helium; Program: 60 0C (1 min) 5 0C/min -> 160 0C 10 0C/min -> 250 0C |
Capillary | BPX-5 | 1215. | Ozer H., Sokmen M., et al., 2007 | 30. m/0.25 mm/0.25 μm, He; Program: 50C => 3C/min => 150C(10min) => 10C/min => 250C |
Capillary | DB-5 | 1240. | Parker, Pollnitz, et al., 2007 | 30. m/0.25 mm/0.25 μm, He; Program: 50C(1min) => 3C/min => 250C(10min) => 20C/min => 280C (5min) |
Capillary | HP-5 | 1243. | Pavlovic, Petrovic, et al., 2007 | 25. m/0.32 mm/0.52 μm, Helium; Program: not specified |
Capillary | HP-5 | 1243. | Ristic, Krivokuca-Dokic, et al., 2007 | 30. m/0.25 mm/0.25 μm, Helium; Program: not specified |
Capillary | BPX-5 | 1218. | Salamci, Kordali, et al., 2007 | 30. m/0.25 mm/0.25 μm, He; Program: 50C => 3C/min => 150C(10min) => 10C/min => 250C |
Capillary | HP-5 | 1271. | Jordan, Martinez, et al., 2006 | 30. m/0.25 mm/0.25 μm, He; Program: 60C(4min) => 1C/min => 64C => 2.5C/min => 155C => 5C/min => 250C |
Capillary | HP-5 | 1235. | Jordan, Martinez, et al., 2006 | 30. m/0.25 mm/0.25 μm, He; Program: 60C(4min) => 1C/min => 64C => 2.5C/min => 155C => 5C/min => 250C |
Capillary | HP-5 | 1241. | Kucuk, Gulec, et al., 2006 | 30. m/0.32 mm/0.25 μm, Helium; Program: not specified |
Capillary | HP-5 | 1235. | Martinez, Madrid, et al., 2006 | 30. m/0.25 mm/0.25 μm; Program: not specified |
Capillary | HP-5 MS | 1240. | Schmidt, Noletto, et al., 2006 | 30. m/0.25 mm/0.25 μm, Helium; Program: 40 0C (10 min) 3 0C/min -> 200 0C 2 0C/min -> 220 0C |
Capillary | SE-52 | 1243. | Tognolini, Barocelli, et al., 2006 | 30. m/0.32 mm/0.15 μm, He; Program: 45C => 1C/min => 100C => 5C/min => 250C (10min) |
Capillary | SE-52 | 1193. | Tognolini, Barocelli, et al., 2006 | 30. m/0.32 mm/0.15 μm, He; Program: 45C => 1C/min => 100C => 5C/min => 250C (10min) |
Capillary | DB-5MS | 1234. | Bagci and Baser, 2005 | 30. m/0.25 mm/0.25 μm; Program: 70C(2min) => 10C/min => 150C(15min) => 5C/min => 240C |
Capillary | CP Sil 8 CB | 1242. | Butkienë, Nivinskienë, et al., 2005 | 50. m/0.32 mm/0.25 μm, He; Program: 50C(5min) => 2C/min => 90C => 15C/min => 240C(4min) |
Capillary | DB-5 | 1237. | Hamm, Bleton, et al., 2005 | 30. m/0.25 mm/0.25 μm, He; Program: 40C(1min) => 9C/min => 130C => 2C/min => 230C |
Capillary | BPX-5 | 1209. | Kordali, Kotan, et al., 2005 | 30. m/0.25 mm/0.25 μm, He; Program: 50C => 3C/min => 150C (10min) => 10C/min => 250C |
Capillary | CP Sil 8 CB | 1243. | Radudienë, Judpintienë, et al., 2005 | 50. m/0.32 mm/0.25 μm, He; Program: 60C(2min) => 5C/min => 160C(1min) => 10C/min => 250C (3min) |
Capillary | CP Sil 8 CB | 1242. | Butkienë, Nivinskienë, et al., 2004 | 50. m/0.32 mm/0.25 μm, He; Program: 50C(5min) => 2C/min => 90C => 15C/min => 240C(4min) |
Capillary | HP-1 | 1210. | Carpino, Mallia, et al., 2004 | 25. m/0.2 mm/0.11 μm; Program: 35C(3min) => 4C/min => 190C => 30C/min => 225C(3min) |
Capillary | Methyl Silicone | 1239. | Couladis, Özcan, et al., 2004 | Program: not specified |
Capillary | 1212. | El-Shazily, Hafez, et al., 2004 | Program: not specified | |
Capillary | DB-5 | 1237. | Hamm, Bleton, et al., 2004 | 30. m/0.25 mm/0.25 μm, He; Program: 40C(1min) => 9C/min => 130C => 2C/min => 230C |
Capillary | HP-5MS | 1243. | Sahin, Gulluce, et al., 2004 | 30. m/0.25 mm/0.25 μm, He; Program: 50C(3min) => 3C/min => 150C(10min) => 10C/min => 250C |
Capillary | HP-5MS | 1244. | Singh, Marimuthu, et al., 2004 | 30. m/0.25 mm/0.25 μm; Program: 60C(1min) => 1.5C/min => 185C(1min) => 9C/min => 275C(2min) |
Capillary | HP-5 | 1235. | Sotomayor, Martínez, et al., 2004 | 30. m/0.25 mm/0.25 μm, He; Program: 60C(4min) => 1C/min => 64C => 2.5C/min => 155C => 5C/min => 250C |
Capillary | DB-5 | 1242. | Vilaseca, Guy, et al., 2004 | Program: not specified |
Capillary | SE-30 | 1220. | Vinogradov, 2004 | Program: not specified |
Capillary | SE-30 | 1189. | Vinogradov, 2004 | Program: not specified |
Capillary | SE-54 | 1246. | Buettner, Mestres, et al., 2003 | 30. m/0.32 mm/0.25 μm; Program: 35C (2min) => 40C/min => 50C (2min) => 6C/min => 180C => 10C/min => 230C (10min) |
Capillary | DB-5 | 1237. | Hamm, Lesellier, et al., 2003 | 30. m/0.25 mm/0.25 μm, He; Program: 40C (1min) => 9C/min => 130C => 2C/min => 230C |
Capillary | HP-5 | 1271. | Jordán, Martínez, et al., 2003 | 30. m/0.25 mm/0.25 μm, He; Program: 60C (4min) => 1C/min => 64C => 2.5C/min => 155C => 5C/min => 250C |
Capillary | HP-5 | 1235. | Jordán, Martínez, et al., 2003 | 30. m/0.25 mm/0.25 μm, He; Program: 60C (4min) => 1C/min => 64C => 2.5C/min => 155C => 5C/min => 250C |
Capillary | AT-5 | 1242. | Usai, Atzei, et al., 2003 | 60. m/0.25 mm/0.25 μm, He; Program: 50 0C 5 0C/min -> 135 0C (1 min) 5 0C/min -> 225 0C (5 min) 5 0C/min -> 260 0C |
Capillary | HP-5 | 1253. | Jordán, Margaría, et al., 2002 | 30. m/0.25 mm/0.25 μm; Program: 40C (6min) => 2.5C/min => 150C => 90C/min => 250C |
Capillary | SE-30 | 1220. | Li, Wu, et al., 2002 | He; Column length: 60. m; Column diameter: 0.25 mm; Program: 50 0C (5 min) 5 0C/min -> 165 0C 4 0C/min -> 230 0C |
Capillary | SE-30 | 1224. | Li, Wu, et al., 2002 | He; Column length: 60. m; Column diameter: 0.25 mm; Program: not specified |
Capillary | HP-5 | 1236. | Aparicio, Romero, et al., 2001 | 30. m/0.25 mm/0.25 μm; Program: not specified |
Capillary | OV-101 | 1224. | Yang, 2001 | N2; Column length: 50. m; Column diameter: 0.25 mm; Program: not specified |
Capillary | DB-1 | 1206. | da Silva, Pedro, et al., 2000 | 30. m/0.25 mm/0.25 μm, H2; Program: 40 0C 3 K/min -> 175 0C 15 K/min -> 240 0C (10 min) |
Capillary | CP Sil 5 CB | 1222. | Weyerstahl, Marschall, et al., 1999, 2 | Column length: 25. m; Column diameter: 0.39 mm; Program: not specified |
Capillary | DB-1 | 1206. | Baratta, Dorman, et al., 1998 | 30. m/0.25 mm/0.25 μm, He; Program: 45C => 3C/min => 175C => 15C/min => 240C (10min) |
Capillary | CP Sil 5 CB | 1215. | Weyerstahl, Marschall, et al., 1998 | He; Column length: 25. m; Phase thickness: 0.39 μm; Program: not specified |
Capillary | DB-5 | 1245. | Anitescu, Doneanu, et al., 1997 | 15. m/0.25 mm/0.25 μm, He; Program: 40C(5min) => 5C/min => 120C(10min) => 4C/min => 250C(4min) => 5C/min => 280C |
Capillary | DB-5 | 1198. | Anitescu, Doneanu, et al., 1997 | 15. m/0.25 mm/0.25 μm, He; Program: 40C(5min) => 5C/min => 120C(10min) => 4C/min => 250C(4min) => 5C/min => 280C |
Capillary | DB-1 | 1206. | Gaspar, Palma, et al., 1997 | 30. m/0.25 mm/0.25 μm, He; Program: 45C => 3C/min => 175C => 15C/min => 280C |
Capillary | DB-5 | 1242. | Isidorov, Zenkevich, et al., 1997 | Program: not specified |
Capillary | DB-5 | 1200. | Isidorov, Zenkevich, et al., 1997 | Program: not specified |
Capillary | CP Sil 5 CB | 1217. | Weyerstahl, Marschall, et al., 1997 | N2; Column length: 30. m; Column diameter: 0.25 mm; Program: not specified |
Capillary | Polydimethyl siloxanes | 1218. | Zenkevich, 1997 | Program: not specified |
Capillary | 5 % Phenyl methyl siloxane | 1229. | Sagrero-Nieves and Bartley, 1995 | Program: not specified |
Capillary | DB-5 | 1238. | Storer, Elmore, et al., 1993 | 30. m/0.32 mm/1. μm; Program: 0C(5min) => 60C/min => 60C (5min) => 4C/min => 250C (5min) |
Capillary | OV-1 | 1215. | De Pooter and Schamp, 1987 | 35. m/0.50 mm/1.5 μm; Program: not specified |
Capillary | OV-101 | 1228. | Shibamoto, 1987 | Program: not specified |
Packed | OV-101 | 1223. | Swigar and Silverstein, 1981 | N2, Chromosorb G 60-80mesh DMCS; Column length: 2.5 m; Program: not specified |

Normal alkane RI, polar column, temperature ramp

Column type | Active phase | I | Reference | Comment |
---|---|---|---|---|
Capillary | RTX-Wax | 1749. | Bendiabdellah, El Amine Dib, et al., 2012 | 60. m/0.22 mm/0.25 μm, Helium, 2. K/min, 230. C @ 5. min; Tstart: 60. C |
Capillary | HP-Innowax | 1737. | Feng, Cui, et al., 2011 | 60. m/0.25 mm/0.25 μm, Helium, 60. C @ 1. min, 5. K/min, 220. C @ 5. min |
Capillary | Innowax | 1745. | Seo, Kim, et al., 2009 | 30. m/0.25 mm/0.25 μm, Helium, 40. C @ 1. min, 6. K/min, 250. C @ 4. min |
Capillary | HP-Innowax | 1751. | Charoensiddhi and Anprung, 2008 | 30. m/0.25 mm/0.25 μm, Helium, 50. C @ 10. min, 15. K/min, 240. C @ 19. min |
Capillary | Carbowax | 1723. | Ferhat, Meklati, et al., 2007 | 60. m/0.2 mm/0.25 μm, He, 60. C @ 8. min, 2. K/min, 250. C @ 15. min |
Capillary | Carbowax | 1722. | Ferhat, Tigrine-Kordjani, et al., 2007 | 60. m/0.2 mm/0.25 μm, He, 60. C @ 8. min, 2. K/min, 250. C @ 15. min |
Capillary | HP-Innowax | 1750. | Formisano, Rigano, et al., 2007 | 30. m/0.25 mm/0.25 μm, Helium, 40. C @ 5. min, 2. K/min; Tend: 250. C |
Capillary | TC-FFAP | 1742. | Kurose, Okamura, et al., 2007 | He, 3. K/min, 220. C @ 30. min; Column diameter: 0.25 mm; Phase thickness: 0.25 μm; Tstart: 60. C |
Capillary | Supelcowax-10 | 1759. | Vichi, Riu-Aumatell, et al., 2007 | 30. m/0.25 mm/0.25 μm, He, 40. C @ 5. min, 3. K/min, 250. C @ 10. min |
Capillary | BP-20 | 1725. | Boti, Muselli, et al., 2006 | 50. m/0.22 mm/0.25 μm, He, 2. K/min, 220. C @ 20. min; Tstart: 60. C |
Capillary | Supelcowax | 1740. | Martin, Joseph, et al., 2006 | 30. m/0.32 mm/0.25 μm, N2, 5. K/min; Tstart: 50. C; Tend: 200. C |
Capillary | HP-Wax | 1713. | Marzouk, Mansour, et al., 2006 | 30. m/0.25 mm/0.25 μm, Nitrogen, 5. K/min, 280. C @ 5. min; Tstart: 50. C |
Capillary | HP-20M | 1713. | Marzouk, Neffati, et al., 2006 | 30. m/0.25 mm/0.25 μm, N2, 5. K/min, 250. C @ 10. min; Tstart: 50. C |
Capillary | NB-20M | 1730. | Orav, Raal, et al., 2006 | 30. m/0.2 mm/0.25 μm, He, 2. K/min; Tstart: 50. C; Tend: 250. C |
Capillary | DB-Wax | 1738. | Sawamura, Onishi, et al., 2006 | 60. m/0.25 mm/0.25 μm, 70. C @ 2. min, 2. K/min, 230. C @ 20. min |
Capillary | Stabilwax | 1715. | Jirovetz, Buchbauer, et al., 2005, 2 | 30. m/0.32 mm/0.5 μm, H2, 40. C @ 5. min, 6. K/min, 280. C @ 5. min |
Capillary | DB-Wax | 1744. | Njoroge, Koaze, et al., 2005, 2 | 60. m/0.25 mm/0.25 μm, N2, 70. C @ 2. min, 2. K/min, 230. C @ 20. min |
Capillary | DB-Wax | 1744. | Njoroge, Koaze, et al., 2005, 3 | 60. m/0.25 mm/0.25 μm, N2, 70. C @ 2. min, 2. K/min, 230. C @ 20. min |
Capillary | BP-20 | 1727. | Blanc, Muselli, et al., 2004 | 50. m/0.22 mm/0.25 μm, 2. K/min, 220. C @ 20. min; Tstart: 60. C |
Capillary | NB-20M | 1735. | Raal, Arak, et al., 2004 | 50. m/0.2 mm/0.25 μm, He, 2. K/min; Tstart: 50. C; Tend: 250. C |
Capillary | DB-Wax | 1750. | Sawamura, Son, et al., 2004 | 60. m/0.25 mm/0.25 μm, 70. C @ 2. min, 2. K/min, 230. C @ 20. min |
Capillary | DB-Wax | 1750. | Sawamura, Sou, et al., 2004 | 60. m/0.25 mm/0.25 μm, Nitrogen, 70. C @ 2. min, 2. K/min; Tend: 230. C |
Capillary | Supelcowax-10 | 1748. | Cabanillas, Lopez, et al., 2003 | 30. m/0.25 mm/0.25 μm, He, 4. K/min; Tstart: 60. C; Tend: 240. C |
Capillary | DB-Wax | 1740. | Mookdasanit, Tamura, et al., 2003 | Helium, 2. K/min, 210. C @ 60. min; Column length: 60. m; Column diameter: 0.25 mm; Tstart: 70. C |
Capillary | Supelcowax-10 | 1725. | Orav, Kailas, et al., 2003 | 50. m/0.2 mm/0.25 μm, He, 2. K/min; Tstart: 70. C; Tend: 230. C |
Capillary | SW-10 | 1720. | Raal, Arak, et al., 2003 | 50. m/0.20 mm/0.25 μm, He, 2. K/min; Tstart: 50. C; Tend: 250. C |
Capillary | HP-Innowax | 1715. | Stashenko, Jaramillo, et al., 2003 | 50. m/0.2 mm/0.2 μm, 50. C @ 5. min, 4. K/min; Tend: 220. C |
Capillary | Innowax | 1751. | Suleimenov, Atazharova, et al., 2003 | He, 60. C @ 10. min, 4. K/min, 220. C @ 10. min; Column length: 60. m; Column diameter: 0.25 mm |
Capillary | DB-Wax | 1726. | Tu, Onishi, et al., 2003 | 60. m/0.25 mm/0.25 μm, N2, 70. C @ 2. min, 2. K/min, 230. C @ 20. min |
Capillary | DB-Wax | 1734. | Tu, Onishi, et al., 2002 | 60. m/0.25 mm/0.25 μm, N2, 70. C @ 2. min, 2. K/min, 230. C @ 20. min |
Capillary | DB-Wax | 1744. | Tu, Thanh, et al., 2002 | 60. m/0.25 mm/0.25 μm, N2, 2. K/min; Tstart: 70. C; Tend: 230. C |
Capillary | Stabilwax | 1717. | Jirovetz L., Buchbauer G., et al., 2001 | 30. m/0.32 mm/0.25 μm, H2, 60. C @ 5. min, 10. K/min, 280. C @ 5. min |
Capillary | PEG-20M | 1725. | Orav, Kailas, et al., 2001 | He, 2. K/min; Column length: 50. m; Column diameter: 0.2 mm; Tstart: 70. C; Tend: 250. C |
Capillary | PEG-20M | 1725. | Orav and Kann, 2001 | He, 2. K/min; Column length: 50. m; Column diameter: 0.2 mm; Tstart: 70. C; Tend: 220. C |
Capillary | Carbowax 20M | 1724. | Vernin, Lageot, et al., 2001 | 50. m/0.22 mm/0.25 μm, He, 2. K/min; Tstart: 60. C; Tend: 220. C |
Capillary | PEG-20M | 1726. | Hirose, Joichi, et al., 1999 | N2, 3. K/min; Column length: 60. m; Column diameter: 0.25 mm; Tstart: 70. C; Tend: 220. C |
Capillary | Innowax | 1755. | Kaya, Baser, et al., 1999 | 60. m/0.25 mm/0.25 μm, He, 60. C @ 10. min; Tend: 220. C |
Capillary | HP-Innowax | 1755. | Kaya, Baser, et al., 1999, 2 | 60. m/0.25 mm/0.25 μm, He, 60. C @ 10. min; Tend: 220. C |
Capillary | HP-Innowax | 1755. | Kaya, Baser, et al., 1999, 2 | 60. m/0.25 mm/0.25 μm, He, 60. C @ 10. min; Tend: 220. C |
Capillary | BP-20 | 1750. | Bignell, Dunlop, et al., 1998 | 25. m/0.33 mm/0.5 μm, H2, 5. K/min; Tstart: 80. C; Tend: 220. C |
Capillary | HP-Innowax | 1705. | Ong, Acree, et al., 1998 | 4. K/min; Column length: 25. m; Column diameter: 0.32 mm; Tstart: 35. C; Tend: 250. C |
Capillary | DB-Wax | 1743. | Werkhoff, Güntert, et al., 1998 | 60. m/0.32 mm/0.25 μm, H2, 3. K/min; Tstart: 60. C; Tend: 220. C |
Capillary | PEG-20M | 1726. | Awano, Ichikawa, et al., 1997 | 3. K/min; Column length: 60. m; Column diameter: 0.25 mm; Tstart: 70. C; Tend: 220. C |
Capillary | BP-20 | 1750. | Bignell, Dunlop, et al., 1997 | 25. m/0.33 mm/0.5 μm, H2, 5. K/min; Tstart: 80. C; Tend: 220. C |
Capillary | BP-20 | 1750. | Bignell, Dunlop, et al., 1997, 2 | 25. m/0.33 mm/0.5 μm, H2, 5. K/min; Tstart: 80. C; Tend: 220. C |
Capillary | BP-20 | 1750. | Bignell, Dunlop, et al., 1997, 3 | 25. m/0.33 mm/0.5 μm, H2, 5. K/min; Tstart: 80. C; Tend: 220. C |
Capillary | BP-20 | 1750. | Bignell, Dunlop, et al., 1997, 4 | 25. m/0.33 mm/0.5 μm, H2, 5. K/min; Tstart: 80. C; Tend: 220. C |
Capillary | BP-20 | 1750. | Bignell, Dunlop, et al., 1997, 5 | 25. m/0.33 mm/0.5 μm, 5. K/min; Tstart: 80. C; Tend: 220. C |
Capillary | BP-20 | 1750. | Bignell, Dunlop, et al., 1997, 6 | 25. m/0.33 mm/0.5 μm, H2, 5. K/min; Tstart: 80. C; Tend: 220. C |
Capillary | DB-Wax | 1707. | Sagrero-Nieves and Bartley, 1996 | 60. m/0.32 mm/0.50 μm, He, 50. C @ 1. min, 8. K/min, 250. C @ 6. min |
Capillary | TC-Wax | 1745. | Shuichi, Masazumi, et al., 1996 | 80. C @ 5. min, 3. K/min; Column length: 60. m; Column diameter: 0.25 mm; Tend: 240. C |
Capillary | Supelcowax-10 | 1738. | Collin, Deslauriers, et al., 1993 | 40. C @ 2. min, 2. K/min, 210. C @ 120. min |
Capillary | Supelcowax-10 | 1738. | Collin, Deslauriers, et al., 1993 | 40. C @ 2. min, 2. K/min, 210. C @ 120. min |
Capillary | Carbowax 20M | 1708. | Kollmannsberger, Nitz, et al., 1992 | 45. m/0.32 mm/1.0 μm, Hydrogen, 60. C @ 5. min, 2. K/min; Tend: 200. C |
Capillary | Carbowax 20M | 1748. | Mihara, Tateba, et al., 1988 | N2, 3. K/min; Column length: 50. m; Column diameter: 0.22 mm; Tstart: 80. C; Tend: 200. C |
Capillary | Carbowax 20M | 1750. | Mihara, Tateba, et al., 1988 | N2, 3. K/min; Column length: 50. m; Column diameter: 0.22 mm; Tstart: 80. C; Tend: 200. C |
Capillary | Carbowax 20M | 1748. | Mihara, Tateba, et al., 1987 | N2, 3. K/min; Column length: 50. m; Column diameter: 0.22 mm; Tstart: 80. C; Tend: 200. C |
Capillary | Carbowax 20M | 1750. | Mihara, Tateba, et al., 1987 | N2, 3. K/min; Column length: 50. m; Column diameter: 0.22 mm; Tstart: 80. C; Tend: 200. C |
Packed | Carbowax 20M | 1763. | Stancher and Pertoldi, 1967 | Hydrogen, Gas-Chrom Z (80-100 mesh), 4. K/min; Column length: 2. m; Tstart: 65. C; Tend: 220. C |

Normal alkane RI, polar column, custom temperature program

Column type | Active phase | I | Reference | Comment |
---|---|---|---|---|
Capillary | HP-Innowax | 1751. | Feng, Cui, et al., 2011 | 60. m/0.25 mm/0.25 μm, Helium; Program: not specified |
Capillary | HP Innowax | 1740. | Laribi, Kouki, et al., 2011 | 30. m/0.25 mm/0.25 μm, Nitrogen; Program: 35 0C (10 min) 3 0C/min -> 205 0C 10 0C/min -> 225 0C |
Capillary | HP Innowax | 1752. | Noorizadeh and Farmany, 2010 | 60. m/0.25 mm/0.33 μm; Program: not specified |
Capillary | Innowax FSC | 1751. | Polatoglu, Demirci, et al., 2010 | 60. m/0.25 mm/0.25 μm, Helium; Program: 60 0C (10 min) 4 0C/min -> 220 0C (10 min) 1 0C/min -> 240 0C |
Capillary | Innowax FSC | 1751. | Baser, Demirci, et al., 2009 | 60. m/0.25 mm/0.25 μm, Helium; Program: 60 0C (10 min) 4 0C/min -> 220 0C (10 min) 1 0C/min -> 240 0C |
Capillary | DB-FFAP | 1695. | Mebazaa, Mahmoudi, et al., 2009 | 30. m/0.25 mm/0.25 μm, Helium; Program: 50 0C 2 0C/min -> 100 0C (5 min) 5 0C/min -> 250 0C |
Capillary | DB-FFAP | 1693. | Mebazaa, Mahmoudi, et al., 2009 | 30. m/0.25 mm/0.25 μm, Helium; Program: not specified |
Capillary | Innowax | 1731. | Aicha, Ines, et al., 2008 | 30. m/0.25 mm/0.25 μm, Helium; Program: not specified |
Capillary | SOLGel-Wax | 1716. | Shu and Shen, 2008 | 30. m/0.53 mm/0.50 μm, Helium; Program: 40 0C 7 0C/min -> 180 0C 10 0C/min -> 240 0C (10 min) |
Capillary | SOLGel-Wax | 1720. | Shu and Shen, 2008 | 30. m/0.53 mm/0.50 μm, Helium; Program: not specified |
Capillary | HP-20M | 1731. | Chaieb, Hajlaoui, et al., 2007 | Program: not specified |
Capillary | HP Innowax FSP | 1751. | Tabanca N., Demirci B., et al., 2007 | 60. m/0.25 mm/0.25 μm, N2; Program: 60C(10min) => 4C/min => 220C(10min) => 1C/min => 240C |
Capillary | DB-Wax | 1732. | Wenguang, Wenlai, et al., 2007 | 30. m/0.25 mm/0.25 μm; Program: 40 0C (3 min) 3 0C/min -> 150 0C (2 min) 6 0C/min -> 230 0C (10 min) |
Capillary | HP-Innowax FSC | 1751. | Demirci B., Baser K.H.C., et al., 2006 | 60. m/0.25 mm/0.25 μm, N2; Program: 60C(10min) => 4C/min => 220C(10min) => 1C/min => 240C |
Capillary | Innowax FSC | 1751. | Iscan, Kirimer, et al., 2006 | 60. m/0.25 mm/0.25 μm, N2; Program: 60C(10min) => 4C/min => 220C(10min) => 1C/min => 240C |
Capillary | HP-Innowax FSC | 1751. | Tabanca, Demirci, et al., 2006 | 60. m/0.25 mm/0.25 μm; Program: 60C(10min) => 4C/min => 220C (10min) => 1C/min => 240C |
Capillary | HP-Innowax FSC | 1751. | Demirci, Demirci, et al., 2005 | 60. m/0.25 mm/0.25 μm, N2; Program: 60C(10min) => 4C/min => 220C (10min) => 1C/min => 240C |
Capillary | Carbowax 20M | 1714. | Editorial paper, 2005 | Program: not specified |
Capillary | Carbowax 20M | 1715. | Editorial paper, 2005 | Program: not specified |
Capillary | Innowax FSC | 1751. | Kosar, Özek, et al., 2005 | 60. m/0.25 mm/0.25 μm, He; Program: 60C(10min) => 4C/min => 220C(10min) => 1C/min => 240C |
Capillary | Innowax FSC | 1751. | Kosar, Özek, et al., 2005 | 60. m/0.25 mm/0.25 μm, He; Program: 60C(10min) => 4C/min => 220C(10min) => 1C/min => 240C |
Capillary | HP-Innowax FSC | 1751. | Sezik E., Kocakulak E., et al., 2005 | 60. m/0.25 mm/0.25 μm, He; Program: 60C(10min) => 4C/min => 220C(10min) => 1C/min => 240C |
Capillary | HP-Innowax FSC | 1751. | Tabanca, Demirci, et al., 2005 | 60. m/0.25 mm/0.25 μm, He; Program: 60C(10min) => 4C/min => 220C(10min) => 1C/min => 240C |
Capillary | HP-Innowax FSC | 1751. | Viljoen, Subramoney, et al., 2005 | 60. m/0.25 mm/0.25 μm, He; Program: 60C(10min) => 4C/min => 220C(10min) => 1C/min => 240C |
Capillary | Innowax FSC | 1751. | Baser, Özek, et al., 2004 | 60. m/0.25 mm/0.25 μm, He; Program: 60C(10min) => 4C/min => 220C(10min) => 1C/min => 240C |
Capillary | HP-Innowax FSC | 1751. | Demirci, Paper, et al., 2004 | 60. m/0.25 mm/0.25 μm, He; Program: 60C(10min) => 4C/min => 220C(10min) => 1C/min => 240C |
Capillary | HP-Innowax FSC | 1751. | Demirci, Paper, et al., 2004, 2 | 60. m/0.25 mm/0.25 μm, N2; Program: 60C(10min) => 4C/min => 220C(10min) => 1C/min => 240C |
Capillary | HP-Innowax FSC | 1751. | Kivcak, Akay, et al., 2004 | 60. m/0.25 mm/0.25 μm, He; Program: 60C(10min) => 4C/min => 220C(10min) => 1C/min => 240C |
Capillary | Carbowax 20M | 1725. | Vinogradov, 2004 | Program: not specified |
Capillary | Innowax FSC | 1751. | Baser, Demirci, et al., 2003 | 60. m/0.25 mm/0.25 μm, He; Program: 60C(10min) => 4C/min => 220C (10min) => 1C/min => 240C |
Capillary | FFAP | 1715. | Buettner, Mestres, et al., 2003 | 30. m/0.32 mm/0.25 μm; Program: 35C (2min) => 40C/min => 60C (2min) => 6C/min => 180C => 10C/min => 230C (10min |
Capillary | HP-Innowax FSC | 1751. | Kaya, Demirci, et al., 2003 | 60. m/0.25 mm/0.25 μm, N2; Program: 60C(10min) => 4C/min => 220C(10min) => 1C/min => 240C |
Capillary | HP-Innowax FSC | 1751. | Kürkcüoglu, Demirci, et al., 2003 | 60. m/0.25 mm/0.25 μm, He; Program: 60C(10min) => 4C/min => 220C(10min) => 1C/min => 240C(40min) |
Capillary | DB-Wax | 1751. | Selli, Cabaroglu, et al., 2003 | 30. m/0.32 mm/0.5 μm, He; Program: 60C(2min) => 2C/min => 220C => 3C/min => 245C(20min) |
Capillary | HP Innowax FSP | 1751. | Tasdemir, Demirci, et al., 2003 | 60. m/0.25 mm/0.25 μm, He; Program: 60C(10min) => 4C/min => 220C (10min) => 1C/min => 240C |
Capillary | Innowax | 1751. | Tunaher, Kirimer, et al., 2003 | 60. m/0.25 mm/0.25 μm, He; Program: 60C(10min) => 4C/min => 220C(10min) => 1C/min => 240C (20min) |
Capillary | HP-Innowax | 1751. | Viljoen, van Vuuren, et al., 2003 | 60. m/0.25 mm/0.25 μm; Program: 60C(10min) => 4C/min => 220C(10min) => 1C/min => 240C |
Capillary | HP-Innowax | 1751. | Baser, Demirci, et al., 2002 | 60. m/0.25 mm/0.25 μm, He; Program: 60 0C (10 min) 4 K/min -> 220 0C (10 min) 1 K/min -> 240 0C |
Capillary | Innowax FSC | 1751. | Baser, Demirei, et al., 2002 | 60. m/0.25 mm/0.25 μm, He; Program: 60C(10min) => 4C/min => 220C(10min) => 1C/min => 240C |
Capillary | Innowax | 1751. | Baser, Nuriddinov, et al., 2002 | 60. m/0.25 mm/0.25 μm, He; Program: 60C(10min) => 4C/min => 220C(10min) => 1C/min => 240C |
Capillary | Supelcowax-10 | 1690. | Kim and Lee, 2002 | 60. m/0.25 mm/0.25 μm, He; Program: 40C (7min) => 4C/min => 150C => 8C/min => 240C (10min) |
Capillary | Innowax FSC | 1751. | Tunalier, Kirimer, et al., 2002 | 60. m/0.25 mm/0.25 μm; Program: 60C(10min) => 4C/min => 220C(10min) => 1C/min => 240C |
Capillary | HP-Innowax | 1751. | Baser, Demirci, et al., 2001 | 60. m/0.25 mm/0.25 μm, He; Program: 60 0C (10 min) 10 K/min -> 220 0C (10 min) 1K/min -> 240 0C |
Capillary | FFAP | 1720. | Buettner and Schieberle, 2001 | 30. m/0.32 mm/0.25 μm, He; Program: 35C (2min) => 40C/min => 60C (2min) => 6C/min => 180C => 10C/min => 230C (10min) |
Capillary | HP-Innowax | 1751. | Gören, Demirci, et al., 2001 | 60. m/0.25 mm/0.25 μm, He; Program: 60 0C (10 min) 4 K/min -> 220 0C (10 min) 1 K/min -> 240 0C |
Capillary | HP-Innowax | 1751. | Tabanca, Kirimer, et al., 2001 | 60. m/0.25 mm/0.25 μm, He; Program: 60C(10min) => 4C/min => 220C(10min) => 1C/min => 240C |
Capillary | Innowax | 1751. | Baser, Özek, et al., 2000 | 60. m/0.25 mm/0.25 μm, He; Program: 60 0C (10 min) 4 K/min -> 220 0C (10 min) 1 K/min -> 240 0C |
Capillary | Innowax FSC | 1755. | Kirimer, Tabanca, et al., 2000 | 60. m/0.25 mm/0.25 μm, He; Program: 60C(10 min) => 4C/min => 220C(10min) => 1C/min => 240C |
Capillary | Innowax FSC | 1755. | Kirimer, Tabanca, et al., 1999 | 60. m/0.25 mm/0.25 μm, Helium; Program: 60 0C (10 min) 4 0C/min -> 220 0C (10 min) 1 0C/min -> 240 0C |
Capillary | Innowax | 1751. | Baser, Kürkcüoglu, et al., 1998 | 60. m/0.25 mm/0.25 μm; Program: 60C(10min) => 4C/min => 220C(10min) => 1C/min => 240C |
Capillary | DB-Wax | 1737. | Weyerstahl, Marschall, et al., 1998 | N2; Column length: 60. m; Phase thickness: 0.25 μm; Program: not specified |
Capillary | CP-Wax 52CB | 1705. | Vernin, 1991 | Column length: 50. m; Column diameter: 0.32 mm; Program: not specified |
Capillary | Carbowax 20M | 1715. | Shibamoto, 1987 | Program: not specified |

References

Kobe, Okabe, et al., 1941
Kobe, K.A.; Okabe, T.S.; Ramstad, M.T.; Huemmer, P.M.,
p-Cymene Studies. VI. Vapor Pressure of p-Cymene, Some of its Derivatives and Related Compounds,
J. Am. Chem. Soc., 1941, 63, 3251. [all data]
Lecat, 1927
Lecat, M.,
New binary azeotropes: 6th list,
Ann. Soc. Sci. Bruxelles, Ser. B, 1927, 47, 63-71. [all data]
Lecat, 1926
Lecat, M.,
New binary azeotropes: 3rd list,
Ann. Soc. Sci. Bruxelles, Ser. B, 1926, 45, 284-94. [all data]
Stull, 1947
Stull, Daniel R.,
Vapor Pressure of Pure Substances. Organic and Inorganic Compounds,
Ind. Eng. Chem., 1947, 39, 4, 517-540, https://doi.org/10.1021/ie50448a022
. [all data]