Germane, tetrapropyl-
- Formula: C12H28Ge
- Molecular weight: 244.99
- IUPAC Standard InChIKey: XSYFWJCOPKYIQN-UHFFFAOYSA-N
- CAS Registry Number: 994-65-0
- Chemical structure:
View 3d structure (requires JavaScript / HTML 5) - Other names: Tetrapropylgermane; tetra-n-Propylgermanium; Tetrapropylgermanium

Gas phase thermochemistry data

Data compiled by: José A. Martinho Simões
Quantity | Value | Units | Method | Reference | Comment |
---|---|---|---|---|---|
ΔfH°gas | -228.6 ± 5.3 | kJ/mol | Review | Martinho Simões |

Condensed phase thermochemistry data

Data compiled by: José A. Martinho Simões
Quantity | Value | Units | Method | Reference | Comment |
---|---|---|---|---|---|
ΔfH°liquid | -290.1 ± 3.3 | kJ/mol | Review | Martinho Simões | |
Quantity | Value | Units | Method | Reference | Comment |
ΔcH°liquid | -8972.6 ± 2.0 | kJ/mol | CC-SB | Pope and Skinner, 1964 | Please also see Pedley and Rylance, 1977 and Cox and Pilcher, 1970. |

Phase change data

Data compiled as indicated in comments:
MS - José A. Martinho Simões
AC - William E. Acree, Jr., James S. Chickos
Quantity | Value | Units | Method | Reference | Comment |
---|---|---|---|---|---|
ΔvapH° | 61.5 ± 4.2 | kJ/mol | CC-SB | Pope and Skinner, 1964 | MS |
Enthalpy of vaporization
ΔvapH (kJ/mol) | Temperature (K) | Method | Reference | Comment |
---|---|---|---|---|
54.7 | 368. | A | Stephenson and Malanowski, 1987 | Based on data from 353. to 493. K.; AC |
Antoine Equation Parameters
log10(P) = A − (B / (T + C))
P = vapor pressure (bar)
T = temperature (K)
View plot Requires a JavaScript / HTML 5 canvas capable browser.
Temperature (K) | A | B | C | Reference | Comment |
---|---|---|---|---|---|
389.59 to 497.69 | 3.97747 | 1573.049 | -106.148 | Mogul, Hochberg, et al., 1974 | Coefficents calculated by NIST from author's data. |

References

Martinho Simões
Martinho Simões, J.A.,
Private communication (see http://webbook.nist.gov/chemistry/om/). [all data]
Pope and Skinner, 1964
Pope, A.E.; Skinner, H.A.,
Thermochemistry of metallic alkyls. Part 12.?Heat of combustion of tetraethyl germanium and of tetrapropyl germanium,
Trans. Faraday Soc., 1964, 60, 1404, https://doi.org/10.1039/tf9646001404
. [all data]
Pedley and Rylance, 1977
Pedley, J.B.; Rylance, J.,
Computer Analysed Thermochemical Data: Organic and Organometallic Compounds, University of Sussex, Brigton, 1977. [all data]
Cox and Pilcher, 1970
Cox, J.D.; Pilcher, G.,
Thermochemistry of Organic and Organometallic Compounds
in Academic Press, New York, 1970. [all data]
Stephenson and Malanowski, 1987
Stephenson, Richard M.; Malanowski, Stanislaw,
Handbook of the Thermodynamics of Organic Compounds, 1987, https://doi.org/10.1007/978-94-009-3173-2
. [all data]
Mogul, Hochberg, et al., 1974
Mogul, Philip H.; Hochberg, Marc C.; Michiel, Robert; Nestel, Glenn K.; Wamsley, Brian L.; Coren, Seth D.,
Physical properties of tetra-n-alkylgermanes (C1-C6),
J. Chem. Eng. Data, 1974, 19, 1, 4-6, https://doi.org/10.1021/je60060a029
. [all data]