Stannane, chlorotriethyl-
- Formula: C6H15ClSn
- Molecular weight: 241.346
- IUPAC Standard InChIKey: PIMYDFDXAUVLON-UHFFFAOYSA-M
- CAS Registry Number: 994-31-0
- Chemical structure:
View 3d structure (requires JavaScript / HTML 5) - Other names: Chlorotriethylstannane; Chlorotriethyltin; Triethylchlorostannane; Triethylchlorotin; Triethylstannyl chloride; Triethyltin chloride; Tin, triethyl-, chloride; Triethyltin chloride ((C2H5)3SnCl); Triaethylzinnchlorid; Triethylstannium chloride; NSC 5283

Phase change data

Data compiled by: José A. Martinho Simões
Quantity | Value | Units | Method | Reference | Comment |
---|---|---|---|---|---|
ΔvapH° | 50.7 | kJ/mol | N/A | Dillard, McNeill, et al., 1958 |

Reaction thermochemistry data

Data compiled by: José A. Martinho Simões
Individual Reactions
(l) +
(l) = C2H5Cl3Sn (l) +
(l)
By formula: C8H20Sn (l) + Cl4Sn (l) = C2H5Cl3Sn (l) + C6H15ClSn (l)
Quantity | Value | Units | Method | Reference | Comment |
---|---|---|---|---|---|
ΔrH° | -94.6 ± 4.6 | kJ/mol | RSC and EST | Nash, Skinner, et al., 1965 |
By formula: 3C8H20Sn (l) + Cl4Sn (l) = 4C6H15ClSn (l)
Quantity | Value | Units | Method | Reference | Comment |
---|---|---|---|---|---|
ΔrH° | -189.5 ± 9.2 | kJ/mol | RSC and EST | Nash, Skinner, et al., 1965 |

References

Dillard, McNeill, et al., 1958
Dillard, C.R.; McNeill, E.H.; Simmons, D.E.; Yeldell, J.B.,
J. Am. Chem. Soc., 1958, 80, 3607. [all data]
Nash, Skinner, et al., 1965
Nash, G.A.; Skinner, H.A.; Stack, W.F.,
Trans. Faraday Soc., 1965, 61, 640. [all data]