1,2,4-trimethylcyclopentene
- Formula: C8H14
- Molecular weight: 110.1968
- IUPAC Standard InChIKey: MSNOKIKTRNYOPS-UHFFFAOYSA-N
- CAS Registry Number: 99363-12-9
- Chemical structure:
View 3d structure (requires JavaScript / HTML 5) - Permanent link for this species. Use this link for bookmarking this species for future reference.

Phase change data

Data compiled by: Thermodynamics Research Center, NIST Boulder Laboratories, Chris Muzny director
Quantity | Value | Units | Method | Reference | Comment |
---|---|---|---|---|---|
Tboil | 392.28 | K | N/A | Slomp, 1951 | Uncertainty assigned by TRC = 0.4 K |
Tboil | 391.9 | K | N/A | Braun, Spooner, et al., 1950 | Uncertainty assigned by TRC = 0.5 K |

References

Slomp, 1951
Slomp, G.,
, Ph.D. Thesis, Ohio State Univ., Columbus, OH, 1951. [all data]
Braun, Spooner, et al., 1950
Braun, W.G.; Spooner, D.F.; Fenske, M.R.,
Raman spectra hydrocarbons and oxygenated compounds,
Anal. Chem., 1950, 22, 1074. [all data]