(dimethylamino)trimethylstannane
- Formula: C5H15NSn
- Molecular weight: 207.889
- CAS Registry Number: 993-50-0

Phase change data

Data compiled by: José A. Martinho Simões
Quantity | Value | Units | Method | Reference | Comment |
---|---|---|---|---|---|
ΔvapH° | 37.7 | kJ/mol | RSC | Baldwin, Lappert, et al., 1972 |

Gas phase thermochemistry data

Data compiled by: José A. Martinho Simões
Quantity | Value | Units | Method | Reference | Comment |
---|---|---|---|---|---|
ΔfH°gas | -4.28 | kcal/mol | Review | Martinho Simões | The enthalpy of formation relies on -90.77 ± 0.98 kcal/mol for the enthalpy of formation of Sn(Me)3(OH)(cr). |

Condensed phase thermochemistry data

Data compiled by: José A. Martinho Simões
Quantity | Value | Units | Method | Reference | Comment |
---|---|---|---|---|---|
ΔfH°liquid | -13.3 ± 1.0 | kcal/mol | Review | Martinho Simões | The enthalpy of formation relies on -90.77 ± 0.98 kcal/mol for the enthalpy of formation of Sn(Me)3(OH)(cr). |

References

Baldwin, Lappert, et al., 1972
Baldwin, J.C.; Lappert, M.F.; Pedley, J.B.; Poland, J.S.,
J. Chem. Soc., Dalton Trans., 1972, 1943.. [all data]