Benzoic acid, 3,5-dinitro-
- Formula: C7H4N2O6
- Molecular weight: 212.1165
- IUPAC Standard InChIKey: VYWYYJYRVSBHJQ-UHFFFAOYSA-N
- CAS Registry Number: 99-34-3
- Chemical structure:
View 3d structure (requires JavaScript / HTML 5) - Other names: Dinitrobenzoic acid; DNBA; 3-Carboxy-1,5-Dinitrobenzene; 3,5-Dinitrobenzoic acid

Condensed phase thermochemistry data

Data compiled by: Hussein Y. Afeefy, Joel F. Liebman, and Stephen E. Stein
Quantity | Value | Units | Method | Reference | Comment |
---|---|---|---|---|---|
ΔfH°solid | -432.6 ± 0.4 | kJ/mol | Ccb | Lebedeva, Ryadnenko, et al., 1971 | Hfusion=5.45±0.2 |
Quantity | Value | Units | Method | Reference | Comment |
ΔcH°solid | -2894. ± 0.4 | kJ/mol | Ccb | Lebedeva, Ryadnenko, et al., 1971 | Hfusion=5.45±0.2 |

Phase change data

Data compiled by: William E. Acree, Jr., James S. Chickos
Enthalpy of fusion
ΔfusH (kJ/mol) | Temperature (K) | Reference |
---|---|---|
22.8 | 480.4 | Lebedeva, Ryadnenko, et al., 1971 |

References

Lebedeva, Ryadnenko, et al., 1971
Lebedeva, N.D.; Ryadnenko, V.L.; Kuznetsova, I.N.,
Heats of combustion and enthalpies of formation of certain aromatic nitro-derivatives,
Russ. J. Phys. Chem. (Engl. Transl.), 1971, 45, 549. [all data]