Trichloro(ethyl)germane

Phase change data

Data compiled by: William E. Acree, Jr., James S. Chickos

Enthalpy of vaporization

ΔvapH (kJ/mol) Temperature (K) Reference Comment
41.9308.Goncharov, Karapet'yants, et al., 1971Based on data from 293. - 415. K.

References

Goncharov, Karapet'yants, et al., 1971
Goncharov, A.K.; Karapet'yants, M.K.; Gar, T.K., Russ. J. Phys. Chem., 1971, 45, 1, 104. [all data]