Benzoyl chloride, 3,5-dinitro-
- Formula: C7H3ClN2O5
- Molecular weight: 230.562
- IUPAC Standard InChIKey: NNOHXABAQAGKRZ-UHFFFAOYSA-N
- CAS Registry Number: 99-33-2
- Chemical structure:
View 3d structure (requires JavaScript / HTML 5) - Other names: 3,5-Dinitrobenzoic acid chloride; 3,5-Dinitrobenzoyl chloride

Phase change data

Data compiled by: Robert L. Brown and Stephen E. Stein
Reduced pressure boiling point
Tboil (K) | Pressure (bar) | Reference |
---|---|---|
469.2 | 0.015 | Aldrich Chemical Company Inc., 1990 |

Van Den Dool and Kratz RI, non-polar column, custom temperature program

Column type | Active phase | I | Reference | Comment |
---|---|---|---|---|
Capillary | VF-5MS | 1706. | Tretyakov, 2011 | 30. m/0.25 mm/0.25 μm, He; Program: Multi-step temperature program; T(initial)=60C; T(final)=270C |

References

Aldrich Chemical Company Inc., 1990
Aldrich Chemical Company Inc.,
Catalog Handbook of Fine Chemicals, Aldrich Chemical Company, Inc., Milwaukee WI, 1990, 1. [all data]
Tretyakov, 2011
Tretyakov, K.V.,
Retention Data. NIST Mass Spectrometry Data Center., NIST Mass Spectrometry Data Center, 2011. [all data]