Botran
- Formula: C6H4Cl2N2O2
- Molecular weight: 207.014
- IUPAC Standard InChIKey: BIXZHMJUSMUDOQ-UHFFFAOYSA-N
- CAS Registry Number: 99-30-9
- Chemical structure:
View 3d structure (requires JavaScript / HTML 5) - Other names: 2,6-Dichloro-4-nitroaniline; Ditranil; Benzenamine, 2,6-dichloro-4-nitro-; Aniline, 2,6-dichloro-4-nitro-; Allisan; Al-50; Bortran; CNA; Dicloran; DCNA; U-2069; 1-Amino-2,6-dichloro-4-nitrobenzene; CDNA; Dichloran (amine fungicide); DCNA (fungicide); Resisan; RD-6584; 2,6-Dichlor-4-nitroanilin; 2,6-Dichloro-4-nitrobenzenamine; 4-Nitroaniline, 2,6-dichloro-; 2,6-Dichloro-p-nitroaniline; 4-Nitro-2,6-dichloroaniline; Batran; Botran 75B; Botran 75W; 2,6-Dichloro-4-nitrobenzeneamine; Dichloran; NSC 218

Phase change data

Data compiled as indicated in comments:
TRC - Thermodynamics Research Center, NIST Boulder Laboratories, Chris Muzny director
AC - William E. Acree, Jr., James S. Chickos
Quantity | Value | Units | Method | Reference | Comment |
---|---|---|---|---|---|
Tfus | 467.44 | K | N/A | Donnelly, Drewes, et al., 1990 | Uncertainty assigned by TRC = 0.2 K; TRC |
Tfus | 466.8 | K | N/A | Plato and Glasgow, 1969 | Uncertainty assigned by TRC = 0.2 K; TRC |
Quantity | Value | Units | Method | Reference | Comment |
ΔsubH° | 26.1 ± 0.2 | kcal/mol | ME | Ribeiro da Silva, Ribeiro da Silva, et al., 2009 | Based on data from 344. to 366. K.; AC |
Enthalpy of sublimation
ΔsubH (kcal/mol) | Temperature (K) | Method | Reference | Comment |
---|---|---|---|---|
25.9 ± 0.1 | 355. | ME | Ribeiro da Silva, Ribeiro da Silva, et al., 2009 | Based on data from 344. to 366. K.; AC |
Enthalpy of fusion
ΔfusH (kcal/mol) | Temperature (K) | Method | Reference | Comment |
---|---|---|---|---|
7.046 | 467.2 | DSC | Acree, 1991 | See also Donnelly, Drewes, et al., 1990, 2.; AC |

Kovats' RI, non-polar column, temperature ramp

Column type | Active phase | I | Reference | Comment |
---|---|---|---|---|
Capillary | DB-1 | 1716. | Hall, Whitehead, et al., 1986 | He, 6. K/min; Column length: 15. m; Column diameter: 0.25 mm; Tstart: 100. C; Tend: 270. C |
Capillary | DB-5 | 1731. | Hall, Whitehead, et al., 1986 | He, 6. K/min; Column length: 15. m; Column diameter: 0.25 mm; Tstart: 100. C; Tend: 270. C |

Van Den Dool and Kratz RI, non-polar column, temperature ramp

Column type | Active phase | I | Reference | Comment |
---|---|---|---|---|
Capillary | SLB-5MS | 1717. | Mondello, Casilli, et al., 2007 | 30. m/0.25 mm/0.25 μm, He, 2. K/min; Tstart: 70. C; Tend: 300. C |
Capillary | SLB-5MS | 1723. | Mondello, Casilli, et al., 2007 | 30. m/0.25 mm/0.25 μm, He, 2. K/min; Tstart: 70. C; Tend: 300. C |

Normal alkane RI, non-polar column, custom temperature program

Column type | Active phase | I | Reference | Comment |
---|---|---|---|---|
Capillary | 5 % Phenyl methyl siloxane | 1734. | Department of Food Safety and Welfare, 2006 | 30. m/0.25 mm/0.25 μm, Helium; Program: 50 0C(1 min) 25 0C/min -> 125 0C 10 0C/min -> 300 0C (10 min) |

Normal alkane RI, polar column, custom temperature program

Column type | Active phase | I | Reference | Comment |
---|---|---|---|---|
Capillary | Carbowax 20M | 2854. | Tameo and Kiyos, 1991 | Program: not specified |

References

Donnelly, Drewes, et al., 1990
Donnelly, J.R.; Drewes, L.A.; Johnson, R.L.; Munslow, W.D.; Knapp, K.K.; Sovocool, G.W.,
Purity and heat of fusion data for environmental standards as determined by differential scanning calorimetry,
Thermochim. Acta, 1990, 167, 2, 155, https://doi.org/10.1016/0040-6031(90)80476-F
. [all data]
Plato and Glasgow, 1969
Plato, C.; Glasgow, A.R., Jr.,
Differential scanning calorimetry as a general method for determining the purity and heat of fusion of high-purity organic chemicals. Application to 95 compounds,
Anal. Chem., 1969, 41, 2, 330, https://doi.org/10.1021/ac60271a041
. [all data]
Ribeiro da Silva, Ribeiro da Silva, et al., 2009
Ribeiro da Silva, Manuel A.V.; Ribeiro da Silva, Maria D.M.C.; Lobo Ferreira, Ana I.M.C.; Santos, Ana Filipa L.O.M.; Galvão, Tiago L.P.,
Experimental thermochemical study of 2,5- and 2,6-dichloro-4-nitroanilines,
The Journal of Chemical Thermodynamics, 2009, 41, 10, 1074-1080, https://doi.org/10.1016/j.jct.2009.04.012
. [all data]
Acree, 1991
Acree, William E.,
Thermodynamic properties of organic compounds: enthalpy of fusion and melting point temperature compilation,
Thermochimica Acta, 1991, 189, 1, 37-56, https://doi.org/10.1016/0040-6031(91)87098-H
. [all data]
Donnelly, Drewes, et al., 1990, 2
Donnelly, J.R.; Drewes, L.A.; Johnson, R.L.; Munslow, W.D.; Knapp, K.K.; Sovocool, G.W.,
Purity and heat of fusion data for environmental standards as determined by differential scanning calorimetry,
Thermochimica Acta, 1990, 167, 2, 155-187, https://doi.org/10.1016/0040-6031(90)80476-F
. [all data]
Hall, Whitehead, et al., 1986
Hall, G.L.; Whitehead, W.E.; Mourer, C.R.; Shibamoto, T.,
A new gas chromatographic retention index for pesticides and related compounds,
J. Hi. Res. Chromatogr. Chromatogr. Comm., 1986, 9, 5, 266-271, https://doi.org/10.1002/jhrc.1240090503
. [all data]
Mondello, Casilli, et al., 2007
Mondello, L.; Casilli, A.; Tranchida, P.Q.; Presti, M.L.; Dugo, P.; Dugo, G.,
Comprehensive gas chromatography coupled to mass spectrometry for the separation of pesticides in a very complex matrix,
Anal. Bioanal. Chem., 2007, 389, 6, 1755-1763, https://doi.org/10.1007/s00216-007-1412-y
. [all data]
Department of Food Safety and Welfare, 2006
Department of Food Safety, Ministry of Health; Welfare,
Analytical methods for residual compositional substances of agricultural chemicals, feed aadditives, and veterinary drugs in foods, 2006, retrieved from http://www.mhlw.go.jp/english/topics/foodsafety/positivelist060228/de/060526-1a.pdf. [all data]
Tameo and Kiyos, 1991
Tameo, O.; Kiyos, I.,
Simultaneous determination of pesticides by capillary gas chromatography,
Cannot be traslated (in Japan), 1991, 14, 2, 109-122. [all data]