Tetramethoxygermanium
- Formula: C4H12GeO4
- Molecular weight: 196.78
- IUPAC Standard InChIKey: ACOVYJCRYLWRLR-UHFFFAOYSA-N
- CAS Registry Number: 992-91-6
- Chemical structure:

Phase change data

Data compiled as indicated in comments:
AC - William E. Acree, Jr., James S. Chickos
MS - José A. Martinho Simões
Quantity | Value | Units | Method | Reference | Comment |
---|---|---|---|---|---|
ΔvapH° | 48.7 | kJ/mol | N/A | Pangrác, Fulem, et al., 2008 | Based on data from 264. to 303. K.; AC |
ΔvapH° | 40.2 ± 0.4 | kJ/mol | CC-SB | Shaulov, Fedorov, et al., 1970 | MS |
Enthalpy of vaporization
ΔvapH (kJ/mol) | Temperature (K) | Reference | Comment |
---|---|---|---|
44.0 | 344. | Bradley, Kay, et al., 1958 | Based on data from 303. to 385. K.; AC |

Gas phase thermochemistry data

Data compiled by: José A. Martinho Simões
Quantity | Value | Units | Method | Reference | Comment |
---|---|---|---|---|---|
ΔfH°gas | -192.1 ± 0.65 | kcal/mol | Review | Martinho Simões | The enthalpy of formation has been derived on the basis of GeO2(am). |

Condensed phase thermochemistry data

Data compiled by: José A. Martinho Simões
Quantity | Value | Units | Method | Reference | Comment |
---|---|---|---|---|---|
ΔfH°liquid | -201.7 ± 0.65 | kcal/mol | Review | Martinho Simões | The enthalpy of formation has been derived on the basis of GeO2(am). |
Quantity | Value | Units | Method | Reference | Comment |
ΔcH°liquid | -713.19 ± 0.41 | kcal/mol | CC-SB | Shaulov, Fedorov, et al., 1970 | Authors have accepted the formation of GeO2(cr, hexagonal). |

References

Pangrác, Fulem, et al., 2008
Pangrác, J.; Fulem, M.; Hulicius, E.; Melichar, K.; Simecek, T.; Ruzicka, K.; Morávek, P.; Ruzicka, V.; Rushworth, S.A.,
Vapor pressure of germanium precursors,
Journal of Crystal Growth, 2008, 310, 23, 4720-4723, https://doi.org/10.1016/j.jcrysgro.2008.06.063
. [all data]
Shaulov, Fedorov, et al., 1970
Shaulov, Yu.Kh.; Fedorov, A.K.; Zueva, G.Ya.; Borisyuk, G.V.; Genchel, V.G.,
Russ. J. Phys. Chem., 1970, 44, 1181. [all data]
Bradley, Kay, et al., 1958
Bradley, D.C.; Kay, L.J.; Swanwick, J.D.; Wardlaw, W.,
732. Germanium esters. Part II. Intermolecular forces and liquid structure,
J. Chem. Soc., 1958, 3656, https://doi.org/10.1039/jr9580003656
. [all data]