2,5-Hexanediol dinitrate
- Formula: C6H12N2O6
- Molecular weight: 208.1693
- IUPAC Standard InChIKey: ISSLCMSTXXUOEU-UHFFFAOYSA-N
- CAS Registry Number: 99115-63-6
- Chemical structure:
View 3d structure (requires JavaScript / HTML 5) - Species with the same structure:

Phase change data

Data compiled by: William E. Acree, Jr., James S. Chickos
Enthalpy of vaporization
ΔvapH (kJ/mol) | Temperature (K) | Method | Reference | Comment |
---|---|---|---|---|
54.4 | 303. | B,GS | Kemp, Goldhagen, et al., 1957 | Based on data from 293. to 313. K. See also Dykyj, 1972. |
Enthalpy of sublimation
ΔsubH (kJ/mol) | Temperature (K) | Method | Reference | Comment |
---|---|---|---|---|
119. | 303. | A | Stephenson and Malanowski, 1987 | Based on data from 293. to 313. K. See also Kemp, Goldhagen, et al., 1957 and Dykyj, 1972. |

References

Kemp, Goldhagen, et al., 1957
Kemp, M.D.; Goldhagen, S.; Zihlman, F.A.,
Vapor Pressures and Cryoscopic Data for Some Aliphatic Dinitroxy and Trinitroxy Compounds,
J. Phys. Chem., 1957, 61, 2, 240-242, https://doi.org/10.1021/j150548a021
. [all data]
Dykyj, 1972
Dykyj, J.,
Petrochemia, 1972, 12, 1, 13. [all data]
Stephenson and Malanowski, 1987
Stephenson, Richard M.; Malanowski, Stanislaw,
Handbook of the Thermodynamics of Organic Compounds, 1987, https://doi.org/10.1007/978-94-009-3173-2
. [all data]