Phenol, 3-(dimethylamino)-
- Formula: C8H11NO
- Molecular weight: 137.1790
- IUPAC Standard InChIKey: MESJRHHDBDCQTH-UHFFFAOYSA-N
- CAS Registry Number: 99-07-0
- Chemical structure:
View 3d structure (requires JavaScript / HTML 5) - Other names: Phenol, m-(dimethylamino)-; (3-Hydroxyphenyl)dimethylamine; m-(Dimethylamino)phenol; N,N-Dimethyl-m-aminophenol; 3-(Dimethylamino)phenol; 3-Hydroxy-N,N-dimethylaniline; DAMP

Reaction thermochemistry data

Data compiled by: John E. Bartmess
Individual Reactions
C8H10NO- + =
By formula: C8H10NO- + H+ = C8H11NO
Quantity | Value | Units | Method | Reference | Comment |
---|---|---|---|---|---|
ΔrH° | 350.3 ± 2.1 | kcal/mol | G+TS | Fujio, McIver, et al., 1981 | gas phase; value altered from reference due to change in acidity scale |
Quantity | Value | Units | Method | Reference | Comment |
ΔrG° | 343.5 ± 2.0 | kcal/mol | IMRE | Fujio, McIver, et al., 1981 | gas phase; value altered from reference due to change in acidity scale |

Gas phase ion energetics data

Data compiled by: John E. Bartmess

De-protonation reactions

C8H10NO- + Hydrogen cation = Phenol, 3-(dimethylamino)-

By formula: C8H10NO- + H+ = C8H11NO

Quantity Value Units Method Reference Comment
Δr350.3 ± 2.1kcal/molG+TSFujio, McIver, et al., 1981gas phase; value altered from reference due to change in acidity scale
Quantity Value Units Method Reference Comment
Δr343.5 ± 2.0kcal/molIMREFujio, McIver, et al., 1981gas phase; value altered from reference due to change in acidity scale

References

Fujio, McIver, et al., 1981
Fujio, M.; McIver, R.T., Jr.; Taft, R.W.,
Effects on the acidities of phenols from specific substituent-solvent interactions. Inherent substituent parameters from gas phase acidities,
J. Am. Chem. Soc., 1981, 103, 4017. [all data]