3-Cyclobutylpentane

Condensed phase thermochemistry data

Data compiled by: Hussein Y. Afeefy, Joel F. Liebman, and Stephen E. Stein

Quantity Value Units Method Reference Comment
Δcliquid-5983. ± 2.kJ/molCcbSkuratov, Kozina, et al., 1957Corresponding Δfliquid = -131. kJ/mol (simple calculation by NIST; no Washburn corrections)

References

Skuratov, Kozina, et al., 1957
Skuratov, S.M.; Kozina, M.L.; Shteher, S.M.; Varushyenko, R.M., The heats of combustion of several purified compounds, Thermochem. Bull. (Moscow State Univ.), March, 1957, 36-37. [all data]