Pyrazinamide
- Formula: C5H5N3O
- Molecular weight: 123.1127
- IUPAC Standard InChIKey: IPEHBUMCGVEMRF-UHFFFAOYSA-N
- CAS Registry Number: 98-96-4
- Chemical structure:
View 3d structure (requires JavaScript / HTML 5) - Other names: Pyrazinecarboxamide; Aldinamid; Aldinamide; D-50; Eprazin; Farmizina; MK 56; Novamid; Pirazimida; Pirazinamid; Pyrafat; Pyrazine Carboxylamide; Pyrazinecarboxylic acid amide; Pyrazinoic acid amide; Tebrazid; Unipyranamide; Zinamide; 2-Carbamylpyrazine; 2-Pyrazinecarboxamide; NCI-C01785; PZA; T 165; Pyrazineamide; NSC 14911; Pyrazine-2-carboxylic acid, amide

Phase change data

Data compiled as indicated in comments:
TRC - Thermodynamics Research Center, NIST Boulder Laboratories, Chris Muzny director
AC - William E. Acree, Jr., James S. Chickos
Quantity | Value | Units | Method | Reference | Comment |
---|---|---|---|---|---|
Tfus | 463. | K | N/A | Grady, Hays, et al., 1973 | Uncertainty assigned by TRC = 1. K; TRC |
Enthalpy of sublimation
ΔsubH (kJ/mol) | Temperature (K) | Method | Reference | Comment |
---|---|---|---|---|
87.9 | 368. | ME | Stephenson and Malanowski, 1987 | Based on data from 353. to 383. K. See also Negoro, Miki, et al., 1960 and Harutada, 1959.; AC |
Enthalpy of fusion
ΔfusH (kJ/mol) | Temperature (K) | Reference | Comment |
---|---|---|---|
30.28 | 463. | Negoro, Miki, et al., 1960, 2 | AC |

References

Grady, Hays, et al., 1973
Grady, L.T.; Hays, S.E.; King, R.H.; Klein, H.R.; Mader, W.J.; Wyatt, D.K.; Zimmere, R.O.,
Drug purity profiles,
J. Pharm. Sci., 1973, 62, 459. [all data]
Stephenson and Malanowski, 1987
Stephenson, Richard M.; Malanowski, Stanislaw,
Handbook of the Thermodynamics of Organic Compounds, 1987, https://doi.org/10.1007/978-94-009-3173-2
. [all data]
Negoro, Miki, et al., 1960
Negoro, H.; Miki, T.; Ueda, S.,
Yakugaku Zasshi, 1960, 80, 665. [all data]
Harutada, 1959
Harutada, N.,
Takamine Kenkyusho Nempo, 1959, 11, 66. [all data]
Negoro, Miki, et al., 1960, 2
Negoro, H.; Miki, T.; Ueda, S.; Sanada, T.; Okada, R.,
Yakugaku Zasshi, 1960, 80, 670. [all data]