Benzene, (dichloromethyl)-
- Formula: C7H6Cl2
- Molecular weight: 161.029
- IUPAC Standard InChIKey: CAHQGWAXKLQREW-UHFFFAOYSA-N
- CAS Registry Number: 98-87-3
- Chemical structure:
View 3d structure (requires JavaScript / HTML 5) - Other names: Toluene, α,α-dichloro-; α,α-Dichlorotoluene; (Dichloromethyl)benzene; Benzal chloride; Benzyl dichloride; Benzylene chloride; Benzylidene chloride; Dichlorophenylmethane; α,α-Dichlortoluene; Benzylidene dichloride; alpha,alpha-Dichlorotoluene; Chlorure de benzylidene; Chlorobenzal; Rcra waste number U017; UN 1886; NSC 7915; α,α-DichlorotoIuene

Phase change data

Data compiled as indicated in comments:
TRC - Thermodynamics Research Center, NIST Boulder Laboratories, Chris Muzny director
BS - Robert L. Brown and Stephen E. Stein
AC - William E. Acree, Jr., James S. Chickos
Quantity | Value | Units | Method | Reference | Comment |
---|---|---|---|---|---|
Tboil | 450.3 | K | N/A | Fenske, Braun, et al., 1947 | Uncertainty assigned by TRC = 0.15 K; TRC |
Quantity | Value | Units | Method | Reference | Comment |
Tfus | 256.2 | K | N/A | Altschul and Von Schneider, 1895 | Uncertainty assigned by TRC = 0.5 K; TRC |
Reduced pressure boiling point
Tboil (K) | Pressure (bar) | Reference | Comment |
---|---|---|---|
355.2 | 0.013 | Aldrich Chemical Company Inc., 1990 | BS |
Enthalpy of vaporization
ΔvapH (kJ/mol) | Temperature (K) | Method | Reference | Comment |
---|---|---|---|---|
49.5 | 323. | A | Stephenson and Malanowski, 1987 | Based on data from 308. to 487. K. See also Stull, 1947.; AC |
Antoine Equation Parameters
log10(P) = A − (B / (T + C))
P = vapor pressure (bar)
T = temperature (K)
View plot Requires a JavaScript / HTML 5 canvas capable browser.
Temperature (K) | A | B | C | Reference | Comment |
---|---|---|---|---|---|
308.6 to 487. | 4.31949 | 1923.675 | -41.157 | Stull, 1947 | Coefficents calculated by NIST from author's data. |

Van Den Dool and Kratz RI, non-polar column, temperature ramp

View large format table.

Column type Active phase I Reference Comment
CapillaryOV-11108.2Gautzsch and Zinn, 19968. K/min; Tstart: 35. C; Tend: 300. C
CapillaryPetrocol DH1107.White, Hackett, et al., 1992100. m/0.25 mm/0.5 μm, He, 1. K/min; Tstart: 30. C; Tend: 220. C

Normal alkane RI, non-polar column, custom temperature program

View large format table.

Column type Active phase I Reference Comment
CapillaryOV-11106.Waggott and Davies, 1984Hydrogen; Column length: 50. m; Column diameter: 0.32 mm; Program: not specified

Normal alkane RI, polar column, custom temperature program

View large format table.

Column type Active phase I Reference Comment
CapillarySuperox 0.6; Carbowax 20M1672.Waggott and Davies, 1984Hydrogen; Column length: 50. m; Column diameter: 0.32 mm; Program: not specified
CapillarySuperox 0.6; Carbowax 20M1690.Waggott and Davies, 1984Hydrogen; Column length: 50. m; Column diameter: 0.32 mm; Program: not specified
CapillaryCarbowax 400, Carbowax 20M, Carbowax 1540, Carbowax 4000, Superox 06, PEG 20M, etc.1672.Waggott and Davies, 1984Hydrogen; Column length: 50. m; Column diameter: 0.32 mm; Program: not specified

References

Fenske, Braun, et al., 1947
Fenske, M.R.; Braun, W.G.; Wiegand, R.V.; Quiggle, D.; McCormick, R.H.; Rank, D.H.,
Raman Spectra of Hydrocarbons,
Anal. Chem., 1947, 19, 700. [all data]
Altschul and Von Schneider, 1895
Altschul, M.; Von Schneider, B.,
Freezing points of some organic fluids,
Z. Phys. Chem., Stoechiom. Verwandtschaftsl., 1895, 16, 24. [all data]
Aldrich Chemical Company Inc., 1990
Aldrich Chemical Company Inc.,
Catalog Handbook of Fine Chemicals, Aldrich Chemical Company, Inc., Milwaukee WI, 1990, 1. [all data]
Stephenson and Malanowski, 1987
Stephenson, Richard M.; Malanowski, Stanislaw,
Handbook of the Thermodynamics of Organic Compounds, 1987, https://doi.org/10.1007/978-94-009-3173-2
. [all data]
Stull, 1947
Stull, Daniel R.,
Vapor Pressure of Pure Substances. Organic and Inorganic Compounds,
Ind. Eng. Chem., 1947, 39, 4, 517-540, https://doi.org/10.1021/ie50448a022
. [all data]