Benzenemethanol, α-methyl-
- Formula: C8H10O
- Molecular weight: 122.1644
- IUPAC Standard InChIKey: WAPNOHKVXSQRPX-UHFFFAOYSA-N
- CAS Registry Number: 98-85-1
- Chemical structure:
View 3d structure (requires JavaScript / HTML 5) - Stereoisomers:
- Other names: Benzyl alcohol, α-methyl-; α-Methylbenzyl alcohol; α-Phenethyl alcohol; α-Phenylethanol; α-Phenylethyl alcohol; (1-Hydroxyethyl)benzene; Ethanol, 1-phenyl-; Methylphenylcarbinol; Phenylmethylcarbinol; Styralyl alcohol; 1-Phenethyl alcohol; 1-Phenyl-1-hydroxyethane; 1-Phenylethanol; 1-Phenylethyl alcohol; sec-Phenethyl alcohol; dl-α-Methylbenzyl alcohol; Methanol, methylphenyl-; NCI-C55685; 1-Fenylethanol; Fenyl-methylkarbinol; Styrallyl alcohol; UN 2937; α-Methylbenzenemethanol; α-Hydroxyethylbenzene; NSC 25502; (S)-α-Methyl-benzenemethanol; alcohol methyl benzylic

Phase change data

Data compiled as indicated in comments:
TRC - Thermodynamics Research Center, NIST Boulder Laboratories, Chris Muzny director
BS - Robert L. Brown and Stephen E. Stein
AC - William E. Acree, Jr., James S. Chickos
Quantity | Value | Units | Method | Reference | Comment |
---|---|---|---|---|---|
Tboil | 476.55 | K | N/A | Anonymous, 1958 | TRC |
Tboil | 475.65 | K | N/A | Zeiss and Tsutsui, 1953 | Uncertainty assigned by TRC = 2. K; TRC |
Tboil | 492.6 | K | N/A | Lecat, 1926 | Uncertainty assigned by TRC = 0.5 K; TRC |
Quantity | Value | Units | Method | Reference | Comment |
Tfus | 294.55 | K | N/A | Anonymous, 1958 | TRC |
Tfus | 288. | K | N/A | Huckel and Wenzke, 1944 | Uncertainty assigned by TRC = 2. K; TRC |
Quantity | Value | Units | Method | Reference | Comment |
ΔvapH° | 18.0 | kcal/mol | EB | Chylinski, Fras, et al., 2004 | Based on data from 358. to 398. K.; AC |
Reduced pressure boiling point
Tboil (K) | Pressure (atm) | Reference | Comment |
---|---|---|---|
477.2 | 0.980 | Weast and Grasselli, 1989 | BS |

Reaction thermochemistry data

Data compiled by: John E. Bartmess
Individual Reactions
C8H9O- + =
By formula: C8H9O- + H+ = C8H10O
Quantity | Value | Units | Method | Reference | Comment |
---|---|---|---|---|---|
ΔrH° | 368.1 ± 2.5 | kcal/mol | G+TS | Abboud, Koppel, et al., 2013 | gas phase |
Quantity | Value | Units | Method | Reference | Comment |
ΔrG° | 361.5 ± 2.4 | kcal/mol | IMRE | Abboud, Koppel, et al., 2013 | gas phase |
ΔrG° | 361.3 ± 2.8 | kcal/mol | CIDC | Graul, Schnute, et al., 1990 | gas phase |

Gas phase ion energetics data

Data compiled by: John E. Bartmess
De-protonation reactions
C8H9O- + =
By formula: C8H9O- + H+ = C8H10O
Quantity | Value | Units | Method | Reference | Comment |
---|---|---|---|---|---|
ΔrH° | 368.1 ± 2.5 | kcal/mol | G+TS | Abboud, Koppel, et al., 2013 | gas phase |
Quantity | Value | Units | Method | Reference | Comment |
ΔrG° | 361.5 ± 2.4 | kcal/mol | IMRE | Abboud, Koppel, et al., 2013 | gas phase |
ΔrG° | 361.3 ± 2.8 | kcal/mol | CIDC | Graul, Schnute, et al., 1990 | gas phase |

Kovats' RI, non-polar column, isothermal

Column type | Active phase | Temperature (C) | I | Reference | Comment |
---|---|---|---|---|---|
Capillary | SE-30 | 100. | 1038. | Korhonen, 1986 | N2; Column length: 25. m; Column diameter: 0.33 mm |
Capillary | SE-30 | 120. | 1042. | Korhonen, 1986 | N2; Column length: 25. m; Column diameter: 0.33 mm |
Capillary | SE-30 | 60. | 1035. | Korhonen, 1986 | N2; Column length: 25. m; Column diameter: 0.33 mm |
Capillary | SE-30 | 80. | 1037. | Korhonen, 1986 | N2; Column length: 25. m; Column diameter: 0.33 mm |
Packed | Apiezon L | 130. | 1042. | Wehrli and Kováts, 1959 | Celite; Column length: 2.25 m |

Kovats' RI, polar column, isothermal

Column type | Active phase | Temperature (C) | I | Reference | Comment |
---|---|---|---|---|---|
Capillary | OV-351 | 100. | 1780. | Korhonen, 1986 | N2; Column length: 25. m; Column diameter: 0.33 mm |
Capillary | OV-351 | 120. | 1785. | Korhonen, 1986 | N2; Column length: 25. m; Column diameter: 0.33 mm |
Capillary | OV-351 | 140. | 1796. | Korhonen, 1986 | N2; Column length: 25. m; Column diameter: 0.33 mm |
Capillary | OV-351 | 160. | 1812. | Korhonen, 1986 | N2; Column length: 25. m; Column diameter: 0.33 mm |
Capillary | OV-351 | 180. | 1813. | Korhonen, 1986 | N2; Column length: 25. m; Column diameter: 0.33 mm |
Capillary | OV-351 | 200. | 1817. | Korhonen, 1986 | N2; Column length: 25. m; Column diameter: 0.33 mm |

Kovats' RI, polar column, temperature ramp

Column type | Active phase | I | Reference | Comment |
---|---|---|---|---|
Capillary | Carbowax 20M | 1764. | Toda, Mihara, et al., 1983 | 2. K/min; Column length: 50. m; Column diameter: 0.23 mm; Tstart: 80. C; Tend: 200. C |
Capillary | Carbowax 20M | 1765. | Toda, Mihara, et al., 1983 | 2. K/min; Column length: 50. m; Column diameter: 0.23 mm; Tstart: 80. C; Tend: 200. C |

Van Den Dool and Kratz RI, non-polar column, temperature ramp

Column type | Active phase | I | Reference | Comment |
---|---|---|---|---|
Capillary | DB-5MS | 1061. | Cho, Namgung, et al., 2008 | 30. m/0.25 mm/0.25 μm, He, 40. C @ 1. min, 4. K/min, 200. C @ 10. min |
Capillary | DB-1 | 1027.7 | Sun and Stremple, 2003 | 30. m/0.25 mm/0.25 μm, He, 3. K/min; Tstart: 40. C; Tend: 325. C |
Capillary | OV-1 | 1033.4 | Gautzsch and Zinn, 1996 | 8. K/min; Tstart: 35. C; Tend: 300. C |
Capillary | DB-1 | 1035. | Coen, Engel, et al., 1995 | 30. m/0.32 mm/0.25 μm, N2, 3. K/min; Tstart: 150. C; Tend: 280. C |
Capillary | DB-1 | 1035. | Coen, Engel, et al., 1995 | 30. m/0.32 mm/0.25 μm, N2, 3. K/min; Tstart: 150. C; Tend: 280. C |
Capillary | SE-30 | 1032. | Misharina, Golovnya, et al., 1991 | 50. m/0.32 mm/0.25 μm, 4. K/min; Tstart: 50. C; Tend: 240. C |
Capillary | SE-30 | 1029. | Korhonen, 1986 | N2, 6. K/min; Column length: 25. m; Column diameter: 0.33 mm; Tstart: 100. C |
Capillary | SE-30 | 1050. | Korhonen, 1986 | N2, 10. K/min; Column length: 25. m; Column diameter: 0.33 mm; Tstart: 50. C |

Van Den Dool and Kratz RI, non-polar column, custom temperature program

Column type | Active phase | I | Reference | Comment |
---|---|---|---|---|
Capillary | DB-1 | 1043. | Place, Imhof, et al., 2003 | 60. m/0.32 mm/1. μm, He; Program: 35C(5min) => 10C/min => 45C (5min) => 5C/min => 250C (10min) |

Van Den Dool and Kratz RI, polar column, temperature ramp

Column type | Active phase | I | Reference | Comment |
---|---|---|---|---|
Capillary | DB-Wax | 1820. | Cho, Namgung, et al., 2008 | 30. m/0.25 mm/0.25 μm, He, 40. C @ 1. min, 4. K/min, 200. C @ 10. min |
Capillary | DB-Wax | 1820. | Cho, Choi, et al., 2006 | 60. m/0.25 mm/0.25 μm, He, 40. C @ 1. min, 4. K/min, 200. C @ 10. min |
Capillary | DB-Wax | 1820. | Cho, Choi, et al., 2006 | 60. m/0.25 mm/0.25 μm, He, 40. C @ 1. min, 4. K/min, 200. C @ 10. min |
Capillary | OV-351 | 1773. | Bonvehí, 2005 | 50. m/0.32 mm/0.2 μm, He, 5. K/min; Tstart: 60. C; Tend: 220. C |
Capillary | Carbowax 20M | 1782. | Verzera, Campisi, et al., 2005 | 60. m/0.25 mm/0.25 μm, He, 45. C @ 0.17 min, 2. K/min; Tend: 250. C |
Capillary | DB-Wax | 1785. | Chyau, Ko, et al., 2003 | 60. m/0.25 mm/0.25 μm, He, 2. K/min, 210. C @ 40. min; Tstart: 40. C |
Capillary | CP-Wax 52CB | 1782. | Verzera, Campisi, et al., 2001 | 60. m/0.25 mm/0.25 μm, He, 45. C @ 0.17 min, 2. K/min; Tend: 250. C |
Capillary | DB-Wax | 1795. | Wirth, Guo, et al., 2001 | 30. m/0.32 mm/0.5 μm, He, 60. C @ 3. min, 3. K/min, 245. C @ 20. min |
Capillary | DB-Wax | 1795. | Wirth, Guo, et al., 2001 | 30. m/0.32 mm/0.5 μm, He, 60. C @ 3. min, 3. K/min, 245. C @ 20. min |
Capillary | Supelcowax-10 | 1819. | Chung, 1999 | 60. m/0.25 mm/0.25 μm, He, 35. C @ 5. min, 2. K/min, 195. C @ 90. min |
Capillary | Supelcowax-10 | 1818. | Chung, 1999, 2 | 60. m/0.25 mm/0.25 μm, He, 35. C @ 5. min, 2. K/min, 195. C @ 90. min |
Capillary | DB-Wax | 1822. | Coen, Engel, et al., 1995 | 30. m/0.32 mm/0.5 μm, He, 2. K/min; Tstart: 50. C; Tend: 230. C |
Capillary | DB-Wax | 1822. | Coen, Engel, et al., 1995 | 30. m/0.32 mm/0.5 μm, He, 2. K/min; Tstart: 50. C; Tend: 230. C |
Capillary | Carbowax 20M | 1791. | Chen, Kuo, et al., 1986 | He, 50. C @ 5. min, 2. K/min, 200. C @ 40. min; Column length: 50. m; Column diameter: 0.32 mm |
Capillary | OV-351 | 1777. | Korhonen, 1986 | N2, 6. K/min; Column length: 25. m; Column diameter: 0.33 mm; Tstart: 100. C; Tend: 220. C |
Capillary | OV-351 | 1776. | Korhonen, 1986 | N2, 10. K/min; Column length: 25. m; Column diameter: 0.33 mm; Tstart: 50. C; Tend: 220. C |

Normal alkane RI, non-polar column, temperature ramp

Column type | Active phase | I | Reference | Comment |
---|---|---|---|---|
Capillary | VF-5 MS | 1063. | Leffingwell and Alford, 2011 | 60. m/0.32 mm/0.25 μm, Helium, 2. K/min, 260. C @ 28. min; Tstart: 30. C |
Capillary | VF-5 MS | 1066. | Leffingwell and Alford, 2011 | 60. m/0.32 mm/0.25 μm, Helium, 2. K/min, 260. C @ 28. min; Tstart: 30. C |
Capillary | DB-5 | 1057. | Tellez, Khan, et al., 2004 | 30. m/0.25 mm/0.25 μm, He, 3. K/min; Tstart: 60. C; Tend: 240. C |
Capillary | OV-101 | 1036. | Spiteller and Spiteller, 1979 | He, 75. C @ 7. min, 2. K/min; Column length: 25. m; Tend: 280. C |

Normal alkane RI, non-polar column, custom temperature program

Column type | Active phase | I | Reference | Comment |
---|---|---|---|---|
Capillary | CP-Sil 8 CB | 1062. | de Freitas, Garruti, et al., 2011 | 30. m/0.25 mm/0.25 μm, Hydrogen; Program: 30 0C 3 0C/min -> 150 0C 20 0C/min -> 220 0C |
Capillary | Nonpolar | 1005. | Staples and Zeiger, 2008 | Program: not specified |
Capillary | Nonpolar | 1015. | Staples and Zeiger, 2008 | Program: not specified |
Capillary | SE-30 | 1051. | Vinogradov, 2004 | Program: not specified |
Capillary | SPB-5 | 1072. | Lee and Kim, 2002 | 60. m/0.25 mm/0.25 μm, Helium; Program: 50 0C (3 min) 4 0C/min -> 200 0C 8 0C/min -> 240 0C (5 min) |
Capillary | CP Sil 5 CB | 1042. | Guyot, Bouseta, et al., 1998 | 50. m/0.32 mm/1.2 μm, He; Program: 30C => 55C/min => 85C => 1C/min => 145C => 3C/min => 250C |

Normal alkane RI, polar column, temperature ramp

Column type | Active phase | I | Reference | Comment |
---|---|---|---|---|
Capillary | VF-Wax MS | 1812. | Duarte, Dias, et al., 2010 | 60. m/0.25 mm/0.25 μm, Helium, 60. C @ 5. min, 3. K/min, 220. C @ 25. min |
Capillary | HP-Innowax | 1827. | Soria, Sanz, et al., 2008 | 50. m/0.20 mm/0.20 μm, Helium, 45. C @ 2. min, 4. K/min, 190. C @ 50. min |
Capillary | BP-20 | 1822. | Rawat, Gulati, et al., 2007 | 30. m/0.25 mm/0.25 μm, He, 70. C @ 4. min, 4. K/min, 220. C @ 5. min |
Capillary | DB-Wax | 1795. | Weckerle, Bastl-Borrmann, et al., 2001 | 30. m/0.25 mm/0.25 μm, He, 50. C @ 3. min, 4. K/min; Tend: 220. C |
Capillary | TC-Wax | 1816. | Shuichi, Masazumi, et al., 1996 | 80. C @ 5. min, 3. K/min; Column length: 60. m; Column diameter: 0.25 mm; Tend: 240. C |
Capillary | DB-Wax | 1825. | Andersen J.F., Mikolajczak K.L., et al., 1987 | Helium, 40. C @ 1. min, 6. K/min; Column length: 30. m; Column diameter: 0.32 mm; Tend: 200. C |
Capillary | Carbowax 20M | 1760. | Buttery, Kamm, et al., 1984 | 1. K/min, 170. C @ 30. min; Column length: 150. m; Column diameter: 0.64 mm; Tstart: 50. C |

Normal alkane RI, polar column, custom temperature program

Column type | Active phase | I | Reference | Comment |
---|---|---|---|---|
Capillary | BP-20 | 1805. | Pontes, Marques, et al., 2007 | 30. m/0.25 mm/0.25 μm, He; Program: 50C(1min) => 2.5C/min => 100C => 2C/min => 180C => 15C/min => 220C |
Capillary | BP-20 | 1805. | Pontes, Marques, et al., 2007 | 30. m/0.25 mm/0.25 μm, He; Program: 50C(1min) => 2.5C/min => 100C => 2C/min => 180C => 15C/min => 220C |
Capillary | Carbowax 20M | 1782. | Editorial paper, 2005 | Program: not specified |
Capillary | Carbowax 20M | 1765. | Vinogradov, 2004 | Program: not specified |
Capillary | HP-Innowax | 1821. | Piasenzotto, Gracco, et al., 2003 | 30. m/0.32 mm/0.5 μm, He; Program: 50C(4min) => 10C/min => 230C(10min) => 10C/min => 250C |
Capillary | Supelcowax-10 | 1801. | Lee and Kim, 2002 | 30. m/0.32 mm/0.25 μm, Helium; Program: 40 0C (5 min) 4 0C/min -> 150 0C 8 0C/min -> 240 0C |

References

Anonymous, 1958
Anonymous, X.,
Am. Pet. Inst. Res. Proj. 50, 1958, Unpublished, 1958. [all data]
Zeiss and Tsutsui, 1953
Zeiss, H.H.; Tsutsui, M.,
The Carbon-Oxygen Absorption Band in the Infrared Spectra of Alcohols,
J. Am. Chem. Soc., 1953, 75, 897. [all data]
Lecat, 1926
Lecat, M.,
New binary azeotropes: 3rd list,
Ann. Soc. Sci. Bruxelles, Ser. B, 1926, 45, 284-94. [all data]
Huckel and Wenzke, 1944
Huckel, W.; Wenzke, U.,
The Association of Aromatic Alcohols,
Z. Phys. Chem. (Leipzig), 1944, 193, 132-61. [all data]
Chylinski, Fras, et al., 2004
Chylinski, Krzysztof; Fras, Zbigniew; Malanowski, Stanislaw K.,
Vapor-Liquid Equilibrium for Phenol + α-Methyl Benzyl Alcohol and 2-Ethoxyethanol + n -Butyl Formate «8224»,
J. Chem. Eng. Data, 2004, 49, 1, 2-6, https://doi.org/10.1021/je025566c
. [all data]
Weast and Grasselli, 1989
CRC Handbook of Data on Organic Compounds, 2nd Editon, Weast,R.C and Grasselli, J.G., ed(s)., CRC Press, Inc., Boca Raton, FL, 1989, 1. [all data]
Abboud, Koppel, et al., 2013
Abboud, J.L.M.; Koppel, I.A.; Koppel, I.,
Additivity of substituent effects on the acidity of alcohols,
J. Phys. Org. Chem., 2013, 26, 6, 467-472, https://doi.org/10.1002/poc.3110
. [all data]
Graul, Schnute, et al., 1990
Graul, S.T.; Schnute, M.E.; Squires, R.R.,
Gas-Phase Acidities of Carboxylic Acids and Alcohols from Collision-Induced Dissociation of Dimer Cluster Ions,
Int. J. Mass Spectrom. Ion Proc., 1990, 96, 2, 181, https://doi.org/10.1016/0168-1176(90)87028-F
. [all data]
Korhonen, 1986
Korhonen, I.O.O.,
Gas-Liquid Chromatographic Analyses. XLVIII. Benzyl, (±)-1-Phenylethyl and 2-Phenylethyl Alcohols and the Corresponding Esters of Benzoic Acid and Its 2-, 3- and 4-Chloro, Pentafluoro, 4-Nitro and 3,5-Dinitro Derivatives on SE-30 and OV-351 Capillary Columns,
J. Chromatogr., 1986, 363, 277-292. [all data]
Wehrli and Kováts, 1959
Wehrli, A.; Kováts, E.,
Gas-chromatographische Charakterisierung ogranischer Verbindungen. Teil 3: Berechnung der Retentionsindices aliphatischer, alicyclischer und aromatischer Verbindungen,
Helv. Chim. Acta, 1959, 7, 7, 2709-2736, https://doi.org/10.1002/hlca.19590420745
. [all data]
Toda, Mihara, et al., 1983
Toda, H.; Mihara, S.; Umano, K.; Shibamoto, T.,
Photochemical studies on jasmin oil,
J. Agric. Food Chem., 1983, 31, 3, 554-558, https://doi.org/10.1021/jf00117a022
. [all data]
Cho, Namgung, et al., 2008
Cho, I.H.; Namgung, H.-J.; Choi, H.-K.; Kim, Y.-S.,
Volatiles and key odorants in the pileus and stipe of pine-mushroom (Tricholoma matsutake Sing.),
Food Chem., 2008, 106, 1, 71-76, https://doi.org/10.1016/j.foodchem.2007.05.047
. [all data]
Sun and Stremple, 2003
Sun, G.; Stremple, P.,
Retention index characterization of flavor, fragrance, and many other compounds on DB-1 and DB-XLB, 2003, retrieved from http://www.chem.agilent.com/cag/cabu/pdf/b-0279.pdf. [all data]
Gautzsch and Zinn, 1996
Gautzsch, R.; Zinn, P.,
Use of incremental models to estimate the retention indexes of aromatic compounds,
Chromatographia, 1996, 43, 3/4, 163-176, https://doi.org/10.1007/BF02292946
. [all data]
Coen, Engel, et al., 1995
Coen, M.; Engel, R.; Nahrstedt, A.,
Chavicol β-D-glucoside, a phenylpropanoid heteroside, benzyl-β-D-glucoside and glycosidically bound volatiles from subspecies of Cedronella canariensis,
Phytochemistry, 1995, 40, 1, 149-155, https://doi.org/10.1016/0031-9422(95)00241-X
. [all data]
Misharina, Golovnya, et al., 1991
Misharina, T.A.; Golovnya, R.V.; Yakovleva, V.N.; Vitt, S.V.,
Pyrazines formed in model glycerin-water systems,
Russ. Chem. Bull. (Engl. Transl.), 1991, 40, 9, 1742-1748, https://doi.org/10.1007/BF00960396
. [all data]
Place, Imhof, et al., 2003
Place, R.B.; Imhof, M.; Teuber, M.; Olivier Bosset, J.,
Distribution of the volatile (flavour) compounds in Raclette cheese produced with different staphylococci in the smear,
Mitt. Lebensmittelunters. Hyg., 2003, 94, 192-211. [all data]
Cho, Choi, et al., 2006
Cho, I.H.; Choi, H.-K.; Kim, Y.-S.,
Difference in the volatile composition of pine-mushrooms (Tricholoma matsutake Sing.) according to their grades,
J. Agric. Food Chem., 2006, 54, 13, 4820-4825, https://doi.org/10.1021/jf0601416
. [all data]
Bonvehí, 2005
Bonvehí, J.S.,
Investigation of aromatic compounds in roasted cocoa powder,
Eur. Food Res. Technol., 2005, 221, 1-2, 19-29, https://doi.org/10.1007/s00217-005-1147-y
. [all data]
Verzera, Campisi, et al., 2005
Verzera, A.; Campisi, S.; Zappalá, M.,
SUPELCO. Using SPME-GC-MS to characterize volatile components of honey as indicators of botanical origin, 2005, retrieved from http://www.sigmaaldrich.com/Brands/SupelcoHome/TheReporter.html. [all data]
Chyau, Ko, et al., 2003
Chyau, C.-C.; Ko, P.-T.; Chang, C.-H.; Mau, J.-L.,
Free and glycosidically bound aroma compounds in lychee (Litchi chinensis Sonn.),
Food Chem., 2003, 80, 3, 387-392, https://doi.org/10.1016/S0308-8146(02)00278-9
. [all data]
Verzera, Campisi, et al., 2001
Verzera, A.; Campisi, S.; Zappalá, M.; Bonaccorsi, I.,
SPME-GC-MS analysis of honey volatile components for the characterization of different floral origin,
Am. Lab. Fairfield Conn., 2001, 33, 15, 18-21. [all data]
Wirth, Guo, et al., 2001
Wirth, J.; Guo, W.; Baumes, R.; Günata, Z.,
Volatile compounds released by enzymatic hydrolysis of glycoconjugates of leaves and grape berries from Vitis vinifera muscat of Alexandria and Shiraz cultivars,
J. Agric. Food Chem., 2001, 49, 6, 2917-2923, https://doi.org/10.1021/jf001398l
. [all data]
Chung, 1999
Chung, H.Y.,
Volatile components in crabmeats of Charybdis feriatus,
J. Agric. Food Chem., 1999, 47, 6, 2280-2287, https://doi.org/10.1021/jf981027t
. [all data]
Chung, 1999, 2
Chung, H.Y.,
Volatile components in fermented soybean (Glycine max) curds,
J. Agric. Food Chem., 1999, 47, 7, 2690-2696, https://doi.org/10.1021/jf981166a
. [all data]
Chen, Kuo, et al., 1986
Chen, C.-C.; Kuo, M.-C.; Liu, S.-E.; Wu, C.-M.,
Volatile components of salted and pickled prunes (Prunus mume Sieb. et Zucc.),
J. Agric. Food Chem., 1986, 34, 1, 140-144, https://doi.org/10.1021/jf00067a038
. [all data]
Leffingwell and Alford, 2011
Leffingwell, J.; Alford, E.D.,
Volatile constituents of the giant pufball mushroom (Calvatia gigantea),
Leffingwell Rep., 2011, 4, 1-17. [all data]
Tellez, Khan, et al., 2004
Tellez, M.R.; Khan, I.A.; Schaneberg, B.T.; Crockett, S.L.; Rimando, A.M.; Kobaisy, M.,
Steam distillation-solid-phase microextraction for the detection of Ephedra sinica in herbal preparations,
J. Chromatogr. A, 2004, 1025, 1, 51-56, https://doi.org/10.1016/S0021-9673(03)01035-5
. [all data]
Spiteller and Spiteller, 1979
Spiteller, M.; Spiteller, G.,
Trennung und charakterisierung saurer harnbest and- teile,
J. Chromatogr., 1979, 164, 3, 253-317, https://doi.org/10.1016/S0378-4347(00)81232-3
. [all data]
de Freitas, Garruti, et al., 2011
de Freitas, V.M.; Garruti, D. dosS.; Souza Neto, M.A.; Facundo, H.V. daV.; Correia, J.M.,
Stability of volatile profile and sensory properties of passion fruit during storage in glass bottles,
Ciencia e Tecnologia de Alimentos, Campinas, 2011, 31, 2, 349-354, https://doi.org/10.1590/S0101-20612011000200011
. [all data]
Staples and Zeiger, 2008
Staples, E.; Zeiger, K.,
On-Site Measurements of VOCs and Odors from Metal Casting Operations Using an Ultra-Fast Gas Chromatograph, 2008, retrieved from http://www.estcal.com/TechPapers/Industrial/FoundryOdors.doc. [all data]
Vinogradov, 2004
Vinogradov, B.A.,
Production, composition, properties and application of essential oils, 2004, retrieved from http://viness.narod.ru. [all data]
Lee and Kim, 2002
Lee, D.-S.; Kim, N.-S.,
Identification of fragrances from chestnut blossom by gas chromatography-ion trap mass spectrometry,
Bull. Korean Chem. Soc., 2002, 23, 11, 1647-1650, https://doi.org/10.5012/bkcs.2002.23.11.1647
. [all data]
Guyot, Bouseta, et al., 1998
Guyot, C.; Bouseta, A.; Scheirman, V.; Collin, S.,
Floral origin markers of chestnut and lime tree honeys,
J. Agric. Food Chem., 1998, 46, 2, 625-633, https://doi.org/10.1021/jf970510l
. [all data]
Duarte, Dias, et al., 2010
Duarte, W.F.; Dias, D.R.; Oliveira, J.M.; Teixeira, J.A.; de Almeida e Silva, J.B.; Schwan, R.F.,
Characterization of different fruit wines made from cacao,cupuassu, gabiroba, jaboticaba and umbu,
Food Sci. Technol., 2010, 43, 1564-1572. [all data]
Soria, Sanz, et al., 2008
Soria, A.C.; Sanz, J.; Martinez-Castro, I.,
SPME followed by GC-MS: a powerful technique for qualitative analysis of honey volatiles,
Eur. Food Res. Technol., 2008, 1-12. [all data]
Rawat, Gulati, et al., 2007
Rawat, R.; Gulati, A.; Babu, G.D.K.; Acharya, R.; Kaul, V.K.; Singh, B.,
Characterization of volatile components of Kangra orthodox black tea by gas chromatography-mass spectrometry,
Food Chem., 2007, 105, 1, 229-235, https://doi.org/10.1016/j.foodchem.2007.03.071
. [all data]
Weckerle, Bastl-Borrmann, et al., 2001
Weckerle, B.; Bastl-Borrmann, R.; Richling, E.; Hör, K.; Ruff, C.; Schreier, P.,
Cactus pear (Opuntia ficus indica) flavour constituents - chiral evaluation (MDGC-MS) and isotope ratio (HRGC-IRMS) analysis,
Flavour Fragr. J., 2001, 16, 5, 360-363, https://doi.org/10.1002/ffj.1012
. [all data]
Shuichi, Masazumi, et al., 1996
Shuichi, H.; Masazumi, N.; Hiromu, K.; Kiyoshi, F.,
Comparison of volatile compounds berween the crude drugs, Onji-tsutsu and Onji-niki,
Nippon nogei kagaku kaishi, 1996, 70, 2, 151-160. [all data]
Andersen J.F., Mikolajczak K.L., et al., 1987
Andersen J.F.; Mikolajczak K.L.; Reed D.K.,
Analysis of peach bark volatiles and their electroantennogram activity with lesser pechtree borer, Synanthedon pictipes (Grote and Robinson),
J. Chem. Ecol., 1987, 13, 11, 2103-2114, https://doi.org/10.1007/BF01012874
. [all data]
Buttery, Kamm, et al., 1984
Buttery, R.G.; Kamm, J.A.; Ling, L.C.,
Volatile components of red clover leaves, flowers, and seed pods: possible insect attractants,
J. Agric. Food Chem., 1984, 32, 2, 254-256, https://doi.org/10.1021/jf00122a019
. [all data]
Pontes, Marques, et al., 2007
Pontes, M.; Marques, J.C.; Camara, J.S.,
Screening of volatile composition from Portuguese multifloral honeys using headspace solid-phase microextraction-gas chromatography-quadrupole mass spectrometry,
Talanta, 2007, 74, 1, 91-103, https://doi.org/10.1016/j.talanta.2007.05.037
. [all data]
Editorial paper, 2005
Editorial paper,
Solid Phase Microextraction (SPME) Application Guide,
The Reporter Europe (Supelco), 2005, 16, 5, 12-12. [all data]
Piasenzotto, Gracco, et al., 2003
Piasenzotto, L.; Gracco, L.; Conte, L.,
Solid phase microextraction (SPME) applied to honey quality control,
J. Sci. Food Agric., 2003, 83, 10, 1037-1044, https://doi.org/10.1002/jsfa.1502
. [all data]