alpha.-Methylbenzylamine
- Formula: C8H11N
- Molecular weight: 121.1796
- IUPAC Standard InChIKey: RQEUFEKYXDPUSK-UHFFFAOYSA-N
- CAS Registry Number: 98-84-0
- Chemical structure:
View 3d structure (requires JavaScript / HTML 5) - Species with the same structure:
- Stereoisomers:
- Other names: Benzenemethanamine, α-methyl-, (.+/-.)-; Benzylamine, α-methyl-, (.+/-.)-; (.+/-.)-α-Methylbenzylamine; (.+/-.)-α-Phenylethylamine; (.+/-.)-1-Phenethylamine; (.+/-.)-1-Phenylethylamine; DL-α-Phenylethylamine; DL-1-Phenylethylamine; Benzenemethanamine, α-methyl-, (±)-; Benzylamine, α-methyl-, (±)-; 1-Amino-1-phenylethane; 1-Phenylethylamine; Benzenemethanamine, α-methyl-; DL-α-Methylbenzylamine; Ethanamine, 1-phenyl-; NSC 8391; α-methyl benzylamine

Phase change data

Data compiled by: William E. Acree, Jr., James S. Chickos
Quantity | Value | Units | Method | Reference | Comment |
---|---|---|---|---|---|
ΔvapH° | 54.9 ± 0.3 | kJ/mol | GS | Verevkin, 1999 | Based on data from 283. to 318. K. |
Enthalpy of vaporization
ΔvapH (kJ/mol) | Temperature (K) | Method | Reference | Comment |
---|---|---|---|---|
54.7 ± 0.3 | 301. | GS | Verevkin, 1999 | Based on data from 283. to 318. K. |

References

Verevkin, 1999
Verevkin, Sergey P.,
Strain Effects in Phenyl-Substituted Methanes. Geminal Interaction between Phenyl and the Electron-Releasing Substituent in Benzylamines and Benzyl Alcohols,
J. Chem. Eng. Data, 1999, 44, 6, 1245-1251, https://doi.org/10.1021/je990118z
. [all data]