Benzene, (1-bromoethenyl)-

Phase change data

Data compiled by: Robert L. Brown and Stephen E. Stein

Reduced pressure boiling point

Tboil (K) Pressure (bar) Reference
341.70.005Aldrich Chemical Company Inc., 1990
353. - 356.0.013Farchan Laboratories, 1990
359.70.019Weast and Grasselli, 1989

References

Aldrich Chemical Company Inc., 1990
Aldrich Chemical Company Inc., Catalog Handbook of Fine Chemicals, Aldrich Chemical Company, Inc., Milwaukee WI, 1990, 1. [all data]

Farchan Laboratories, 1990
Farchan Laboratories, Research Chemicals Catalog, Farchan Laboratories, Gainesville, FL, 1990, 91. [all data]

Weast and Grasselli, 1989
CRC Handbook of Data on Organic Compounds, 2nd Editon, Weast,R.C and Grasselli, J.G., ed(s)., CRC Press, Inc., Boca Raton, FL, 1989, 1. [all data]